1.7.2 Release Candidate

classic Classic list List threaded Threaded
24 messages Options
12
Reply | Threaded
Open this post in threaded view
|

1.7.2 Release Candidate

Sergey
Administrator
Dear all,

We have just tagged first release candidate for 1.7.2. The release will include all bug fixes and improvements submitted since the previous release in October 2013. As before, some unstable/experimental modules were left out:

  * pcl_2d
  * pcl_cuda
  * pcl_gpu
  * pcl_ml
  * pcl_simulation
  * pcl_stereo

You are welcome to check if everything is working and report you findings here.

Regards,
Sergey
Reply | Threaded
Open this post in threaded view
|

Re: 1.7.2 Release Candidate

VictorL
Hello,

How do update the tags using git ? I can't see the tag "pcl-1.7.2rc1.1" in my local repo
$ git remote -v
origin git@github.com:VictorLamoine/pcl.git (fetch)
origin git@github.com:VictorLamoine/pcl.git (push)
upstream https://github.com/PointCloudLibrary/pcl.git (fetch)
upstream https://github.com/PointCloudLibrary/pcl.git (push)

$ git fetch upstream

$ git tag -l
pcl-1.0.0
pcl-1.0.1
pcl-1.1.0
pcl-1.1.0-rc
pcl-1.1.1
pcl-1.1.2
pcl-1.2
pcl-1.3.0
pcl-1.3.1
pcl-1.4.0
pcl-1.5.0
pcl-1.5.1
pcl-1.6.0
pcl-1.6.0rc1
pcl-1.7.0
pcl-1.7.0rc1
pcl-1.7.0rc2
pcl-1.7.0rc2.1
pcl-1.7.1
pcl-ros-1.0
I'm using git 1.9.1

Bye!
Reply | Threaded
Open this post in threaded view
|

Re: 1.7.2 Release Candidate

Sergey
Administrator
Victor,

git pull --tags

Regards,
Sergey
Reply | Threaded
Open this post in threaded view
|

Re: 1.7.2 Release Candidate

VictorL
Thank you I couldn't find this one the web

It compiles fines for me:
Dell M6700
Ubuntu 14.04 x64
cmake version 2.8.12.2
gcc version 4.8.2 (Ubuntu 4.8.2-19ubuntu1)
VTK 5.8

# This is the CMakeCache file.
# For build in directory: /home/dell/pcl-1.7.2rc1.1/build
# It was generated by CMake: /usr/bin/cmake
# You can edit this file to change values found and used by cmake.
# If you do not want to change any of the values, simply exit the editor.
# If you do want to change a value, simply edit, save, and exit the editor.
# The syntax for the file is as follows:
# KEY:TYPE=VALUE
# KEY is the name of a variable in the cache.
# TYPE is a hint to GUIs for the type of VALUE, DO NOT EDIT TYPE!.
# VALUE is the current value for the KEY.

########################
# EXTERNAL cache entries
########################

//The threading library used by boost-thread
BOOST_THREAD_LIBRARY:FILEPATH=/usr/lib/x86_64-linux-gnu/libpthread.so

//Build the OpenNI Grabber.
BUILD_OPENNI:BOOL=ON

//Build the OpenNI 2 Grabber.
BUILD_OPENNI2:BOOL=OFF

//Application examples/samples that show how PCL works
BUILD_apps:BOOL=ON

//Cloud Composer - Application for Manipulating Point Clouds
BUILD_apps_cloud_composer:BOOL=ON

//Application examples/samples that show how PCL works
BUILD_apps_in_hand_scanner:BOOL=ON

//Application examples/samples that show how PCL works
BUILD_apps_modeler:BOOL=ON

//PCL Optronic Viewer
BUILD_apps_optronic_viewer:BOOL=ON

//Application examples/samples that show how PCL works
BUILD_apps_point_cloud_editor:BOOL=ON

//Point cloud common library
BUILD_common:BOOL=ON

//PCL examples
BUILD_examples:BOOL=ON

//Point cloud features library
BUILD_features:BOOL=ON

//Point cloud filters library
BUILD_filters:BOOL=ON

//Point cloud geometry library
BUILD_geometry:BOOL=ON

//Point cloud library global unit tests
BUILD_global_tests:BOOL=ON

//Point cloud IO library
BUILD_io:BOOL=ON

//Point cloud kd-tree library
BUILD_kdtree:BOOL=ON

//Point cloud keypoints library
BUILD_keypoints:BOOL=ON

//Point cloud octree library
BUILD_octree:BOOL=ON

//Point cloud outofcore library
BUILD_outofcore:BOOL=ON

//Point cloud people library
BUILD_people:BOOL=ON

//Point cloud recognition library
BUILD_recognition:BOOL=ON

//Point cloud registration library
BUILD_registration:BOOL=ON

//Point cloud sample consensus library
BUILD_sample_consensus:BOOL=ON

//Point cloud generic search library
BUILD_search:BOOL=ON

//Point cloud segmentation library
BUILD_segmentation:BOOL=ON

//Point cloud surface library
BUILD_surface:BOOL=ON

//Fitting NURBS to point-clouds using openNURBS
BUILD_surface_on_nurbs:BOOL=ON

//Useful PCL-based command line tools
BUILD_tools:BOOL=ON

//Point cloud tracking library
BUILD_tracking:BOOL=ON

//Point cloud visualization library
BUILD_visualization:BOOL=ON

//Boost chrono library (debug)
Boost_CHRONO_LIBRARY_DEBUG:FILEPATH=/usr/lib/x86_64-linux-gnu/libboost_chrono.so

//Boost chrono library (release)
Boost_CHRONO_LIBRARY_RELEASE:FILEPATH=/usr/lib/x86_64-linux-gnu/libboost_chrono.so

//Boost date_time library (debug)
Boost_DATE_TIME_LIBRARY_DEBUG:FILEPATH=/usr/lib/x86_64-linux-gnu/libboost_date_time.so

//Boost date_time library (release)
Boost_DATE_TIME_LIBRARY_RELEASE:FILEPATH=/usr/lib/x86_64-linux-gnu/libboost_date_time.so

//Boost filesystem library (debug)
Boost_FILESYSTEM_LIBRARY_DEBUG:FILEPATH=/usr/lib/x86_64-linux-gnu/libboost_filesystem.so

//Boost filesystem library (release)
Boost_FILESYSTEM_LIBRARY_RELEASE:FILEPATH=/usr/lib/x86_64-linux-gnu/libboost_filesystem.so

//Path to a file.
Boost_INCLUDE_DIR:PATH=/usr/include

//Boost iostreams library (debug)
Boost_IOSTREAMS_LIBRARY_DEBUG:FILEPATH=/usr/lib/x86_64-linux-gnu/libboost_iostreams.so

//Boost iostreams library (release)
Boost_IOSTREAMS_LIBRARY_RELEASE:FILEPATH=/usr/lib/x86_64-linux-gnu/libboost_iostreams.so

//Boost library directory
Boost_LIBRARY_DIR:PATH=/usr/lib/x86_64-linux-gnu

//Boost mpi library (debug)
Boost_MPI_LIBRARY_DEBUG:FILEPATH=/usr/lib/x86_64-linux-gnu/libboost_mpi.so

//Boost mpi library (release)
Boost_MPI_LIBRARY_RELEASE:FILEPATH=/usr/lib/x86_64-linux-gnu/libboost_mpi.so

//Boost serialization library (debug)
Boost_SERIALIZATION_LIBRARY_DEBUG:FILEPATH=/usr/lib/x86_64-linux-gnu/libboost_serialization.so

//Boost serialization library (release)
Boost_SERIALIZATION_LIBRARY_RELEASE:FILEPATH=/usr/lib/x86_64-linux-gnu/libboost_serialization.so

//Boost system library (debug)
Boost_SYSTEM_LIBRARY_DEBUG:FILEPATH=/usr/lib/x86_64-linux-gnu/libboost_system.so

//Boost system library (release)
Boost_SYSTEM_LIBRARY_RELEASE:FILEPATH=/usr/lib/x86_64-linux-gnu/libboost_system.so

//Boost thread library (debug)
Boost_THREAD_LIBRARY_DEBUG:FILEPATH=/usr/lib/x86_64-linux-gnu/libboost_thread.so

//Boost thread library (release)
Boost_THREAD_LIBRARY_RELEASE:FILEPATH=/usr/lib/x86_64-linux-gnu/libboost_thread.so

//Path to a program.
CMAKE_AR:FILEPATH=/usr/bin/ar

//Choose the type of build, options are: None Debug Release RelWithDebInfo
// MinSizeRel Maintainer.
CMAKE_BUILD_TYPE:STRING=Release

//Enable/Disable color output during build.
CMAKE_COLOR_MAKEFILE:BOOL=ON

//possible configurations
CMAKE_CONFIGURATION_TYPES:STRING=Debug;Release

//CXX compiler.
CMAKE_CXX_COMPILER:FILEPATH=/usr/lib/ccache/c++

//Flags used by the compiler during all build types.
CMAKE_CXX_FLAGS:STRING=

//Flags used by the compiler during debug builds.
CMAKE_CXX_FLAGS_DEBUG:STRING=-g

//Flags used by the C++ compiler during maintainer builds.
CMAKE_CXX_FLAGS_MAINTAINER:STRING=-pedantic -Wno-variadic-macros -Weffc++ -Wno-long-long

//Flags used by the compiler during release minsize builds.
CMAKE_CXX_FLAGS_MINSIZEREL:STRING=-Os -DNDEBUG

//Flags used by the compiler during release builds (/MD /Ob1 /Oi
// /Ot /Oy /Gs will produce slightly less optimized but smaller
// files).
CMAKE_CXX_FLAGS_RELEASE:STRING=-O3 -DNDEBUG

//Flags used by the compiler during Release with Debug Info builds.
CMAKE_CXX_FLAGS_RELWITHDEBINFO:STRING=-O2 -g -DNDEBUG

//C compiler.
CMAKE_C_COMPILER:FILEPATH=/usr/lib/ccache/cc

//Flags used by the compiler during all build types.
CMAKE_C_FLAGS:STRING=

//Flags used by the compiler during debug builds.
CMAKE_C_FLAGS_DEBUG:STRING=-g

//Flags used by the C compiler during maintainer builds.
CMAKE_C_FLAGS_MAINTAINER:STRING=-pedantic -Wno-variadic-macros -Weffc++ -Wno-long-long

//Flags used by the compiler during release minsize builds.
CMAKE_C_FLAGS_MINSIZEREL:STRING=-Os -DNDEBUG

//Flags used by the compiler during release builds (/MD /Ob1 /Oi
// /Ot /Oy /Gs will produce slightly less optimized but smaller
// files).
CMAKE_C_FLAGS_RELEASE:STRING=-O3 -DNDEBUG

//Flags used by the compiler during Release with Debug Info builds.
CMAKE_C_FLAGS_RELWITHDEBINFO:STRING=-O2 -g -DNDEBUG

//Flags used by the linker.
CMAKE_EXE_LINKER_FLAGS:STRING=' '

//Flags used by the linker during debug builds.
CMAKE_EXE_LINKER_FLAGS_DEBUG:STRING=

//Flags used for linking binaries during maintainer builds.
CMAKE_EXE_LINKER_FLAGS_MAINTAINER:STRING=-Wl,--warn-unresolved-symbols,--warn-once

//Flags used by the linker during release minsize builds.
CMAKE_EXE_LINKER_FLAGS_MINSIZEREL:STRING=

//Flags used by the linker during release builds.
CMAKE_EXE_LINKER_FLAGS_RELEASE:STRING=

//Flags used by the linker during Release with Debug Info builds.
CMAKE_EXE_LINKER_FLAGS_RELWITHDEBINFO:STRING=

//Enable/Disable output of compile commands during generation.
CMAKE_EXPORT_COMPILE_COMMANDS:BOOL=OFF

//Install path prefix, prepended onto install directories.
CMAKE_INSTALL_PREFIX:PATH=/usr/local

//Path to a program.
CMAKE_LINKER:FILEPATH=/usr/bin/ld

//Path to a program.
CMAKE_MAKE_PROGRAM:FILEPATH=/usr/bin/make

//Flags used by the linker during the creation of modules.
CMAKE_MODULE_LINKER_FLAGS:STRING=' '

//Flags used by the linker during debug builds.
CMAKE_MODULE_LINKER_FLAGS_DEBUG:STRING=

//Flags used by the linker during release minsize builds.
CMAKE_MODULE_LINKER_FLAGS_MINSIZEREL:STRING=

//Flags used by the linker during release builds.
CMAKE_MODULE_LINKER_FLAGS_RELEASE:STRING=

//Flags used by the linker during Release with Debug Info builds.
CMAKE_MODULE_LINKER_FLAGS_RELWITHDEBINFO:STRING=

//Enable the /GL and /LTCG code and link optimization options for
// MSVC. Enabled by default.
CMAKE_MSVC_CODE_LINK_OPTIMIZATION:BOOL=ON

//Path to a program.
CMAKE_NM:FILEPATH=/usr/bin/nm

//Path to a program.
CMAKE_OBJCOPY:FILEPATH=/usr/bin/objcopy

//Path to a program.
CMAKE_OBJDUMP:FILEPATH=/usr/bin/objdump

//Value Computed by CMake
CMAKE_PROJECT_NAME:STATIC=PCL

//Path to a program.
CMAKE_RANLIB:FILEPATH=/usr/bin/ranlib

//Flags used by the linker during the creation of dll's.
CMAKE_SHARED_LINKER_FLAGS:STRING=' '

//Flags used by the linker during debug builds.
CMAKE_SHARED_LINKER_FLAGS_DEBUG:STRING=

//Flags used by the shared libraries linker during maintainer builds.
CMAKE_SHARED_LINKER_FLAGS_MAINTAINER:STRING=-Wl,--warn-unresolved-symbols,--warn-once

//Flags used by the linker during release minsize builds.
CMAKE_SHARED_LINKER_FLAGS_MINSIZEREL:STRING=

//Flags used by the linker during release builds.
CMAKE_SHARED_LINKER_FLAGS_RELEASE:STRING=

//Flags used by the linker during Release with Debug Info builds.
CMAKE_SHARED_LINKER_FLAGS_RELWITHDEBINFO:STRING=

//If set, runtime paths are not added when installing shared libraries,
// but are added when building.
CMAKE_SKIP_INSTALL_RPATH:BOOL=NO

//If set, runtime paths are not added when using shared libraries.
CMAKE_SKIP_RPATH:BOOL=NO

//Flags used by the linker during the creation of static libraries.
CMAKE_STATIC_LINKER_FLAGS:STRING=

//Flags used by the linker during debug builds.
CMAKE_STATIC_LINKER_FLAGS_DEBUG:STRING=

//Flags used by the linker during release minsize builds.
CMAKE_STATIC_LINKER_FLAGS_MINSIZEREL:STRING=

//Flags used by the linker during release builds.
CMAKE_STATIC_LINKER_FLAGS_RELEASE:STRING=

//Flags used by the linker during Release with Debug Info builds.
CMAKE_STATIC_LINKER_FLAGS_RELWITHDEBINFO:STRING=

//Path to a program.
CMAKE_STRIP:FILEPATH=/usr/bin/strip

//Enable the display of timing information for each compiler instance.
CMAKE_TIMING_VERBOSE:BOOL=OFF

//If true, cmake will use relative paths in makefiles and projects.
CMAKE_USE_RELATIVE_PATHS:BOOL=OFF

//If this value is on, makefiles will be generated without the
// .SILENT directive, and all commands will be echoed to the console
// during the make.  This is useful for debugging only. With Visual
// Studio IDE projects all commands are done without /nologo.
CMAKE_VERBOSE_MAKEFILE:BOOL=FALSE

//Enable to build TBZ2 source packages
CPACK_SOURCE_TBZ2:BOOL=ON

//Enable to build TGZ source packages
CPACK_SOURCE_TGZ:BOOL=ON

//Enable to build TZ source packages
CPACK_SOURCE_TZ:BOOL=ON

//Enable to build ZIP source packages
CPACK_SOURCE_ZIP:BOOL=OFF

//Graphviz Dot tool for using Doxygen
DOXYGEN_DOT_EXECUTABLE:FILEPATH=/usr/bin/dot

DOXYGEN_DOT_PATH:FILEPATH=/usr/bin

//Doxygen documentation generation tool (http://www.doxygen.org)
DOXYGEN_EXECUTABLE:FILEPATH=/usr/bin/doxygen

//Generate shorter (but less readable) file names
DOXYGEN_USE_SHORT_NAMES:BOOL=OFF

//Path to a program.
DPKG_PROGRAM:FILEPATH=/usr/bin/dpkg

//Path to a file.
EIGEN_INCLUDE_DIR:PATH=/usr/include/eigen3

//Path to a file.
FLANN_INCLUDE_DIR:PATH=/usr/include

//Path to a library.
FLANN_LIBRARY:FILEPATH=/usr/lib/x86_64-linux-gnu/libflann_cpp.so

//Path to a library.
FLANN_LIBRARY_DEBUG:FILEPATH=/usr/lib/x86_64-linux-gnu/libflann_cpp.so

//Fotonic include directories
FZAPI_INCLUDE_DIR:PATH=FZAPI_INCLUDE_DIR-NOTFOUND

//Fotonic libraries
FZAPI_LIBS:FILEPATH=FZAPI_LIBS-NOTFOUND

//directory of Fotonic API
FZ_API_DIR:FILEPATH=default value

//Path to a file.
GLUT_INCLUDE_DIR:PATH=/usr/include

//Path to a library.
GLUT_Xi_LIBRARY:FILEPATH=/usr/lib/x86_64-linux-gnu/libXi.so

//Path to a library.
GLUT_Xmu_LIBRARY:FILEPATH=/usr/lib/x86_64-linux-gnu/libXmu.so

//Path to a library.
GLUT_glut_LIBRARY:FILEPATH=/usr/lib/x86_64-linux-gnu/libglut.so

//Path to a file.
GTEST_INCLUDE_DIR:PATH=/usr/include

//Path to a file.
GTEST_SRC_DIR:PATH=/usr/src/gtest

//Path to a file.
LIBUSB_1_INCLUDE_DIR:PATH=/usr/include

//Path to a library.
LIBUSB_1_LIBRARY:FILEPATH=/usr/lib/x86_64-linux-gnu/libusb-1.0.so

//Path to a file.
OPENGL_INCLUDE_DIR:PATH=/usr/include

//Path to a library.
OPENGL_gl_LIBRARY:FILEPATH=/usr/lib/x86_64-linux-gnu/libGL.so

//Path to a library.
OPENGL_glu_LIBRARY:FILEPATH=/usr/lib/x86_64-linux-gnu/libGLU.so

//Path to a file.
OPENGL_xmesa_INCLUDE_DIR:PATH=OPENGL_xmesa_INCLUDE_DIR-NOTFOUND

//Path to a file.
OPENNI2_INCLUDE_DIRS:PATH=/usr/include/openni2

//Path to a library.
OPENNI2_LIBRARY:FILEPATH=/usr/lib/libOpenNI2.so

//Path to a file.
OPENNI_INCLUDE_DIR:PATH=/usr/include/ni

//Path to a library.
OPENNI_LIBRARY:FILEPATH=/usr/lib/libOpenNI.so

//C++ compiler flags for OpenMP parallization
OpenMP_CXX_FLAGS:STRING=-fopenmp

//C compiler flags for OpenMP parallization
OpenMP_C_FLAGS:STRING=-fopenmp

//Path to a file.
PCAP_INCLUDE_DIR:PATH=PCAP_INCLUDE_DIR-NOTFOUND

//Path to a library.
PCAP_LIBRARY:FILEPATH=PCAP_LIBRARY-NOTFOUND

//Value Computed by CMake
PCL_BINARY_DIR:STATIC=/home/dell/pcl-1.7.2rc1.1/build

//Build against a dynamically linked Boost on Win32 platforms.
PCL_BUILD_WITH_BOOST_DYNAMIC_LINKING_WIN32:BOOL=OFF

//Enable or Disable SSE optimizations.
PCL_ENABLE_SSE:BOOL=ON

//Do not precompile PCL code for any point types at all.
PCL_NO_PRECOMPILE:BOOL=OFF

//Compile explicitly only for a small subset of point types (e.g.,
// pcl::PointXYZ instead of PCL_XYZ_POINT_TYPES).
PCL_ONLY_CORE_POINT_TYPES:BOOL=OFF

//Build shared libraries.
PCL_SHARED_LIBS:BOOL=ON

//Value Computed by CMake
PCL_SOURCE_DIR:STATIC=/home/dell/pcl-1.7.2rc1.1

//Set PCL verbosity level. Available options are: Always Error
// Warn Info Debug Verbose
PCL_VERBOSITY_LEVEL:STRING=Info

//PCL version
PCL_VERSION:STRING=1.7.2

//pkg-config executable
PKG_CONFIG_EXECUTABLE:FILEPATH=/usr/bin/pkg-config

//Path to a library.
PNG_LIBRARY_DEBUG:FILEPATH=PNG_LIBRARY_DEBUG-NOTFOUND

//Path to a library.
PNG_LIBRARY_RELEASE:FILEPATH=/usr/lib/x86_64-linux-gnu/libpng.so

//Path to a file.
PNG_PNG_INCLUDE_DIR:PATH=/usr/include

//PXCAPI include directories
PXCAPI_DIR:PATH=PXCAPI_DIR-NOTFOUND

//Path to a program.
PYTHON_EXECUTABLE:FILEPATH=/usr/bin/python

//QHull include dir.
QHULL_INCLUDE_DIR:PATH=/usr/include

//Path to a library.
QHULL_LIBRARY:FILEPATH=/usr/lib/x86_64-linux-gnu/libqhull.so

//Path to a library.
QHULL_LIBRARY_DEBUG:FILEPATH=/usr/lib/x86_64-linux-gnu/libqhull.so

//Path to a library.
QT_ARTHURPLUGIN_PLUGIN_DEBUG:FILEPATH=QT_ARTHURPLUGIN_PLUGIN_DEBUG-NOTFOUND

//Path to a library.
QT_ARTHURPLUGIN_PLUGIN_RELEASE:FILEPATH=QT_ARTHURPLUGIN_PLUGIN_RELEASE-NOTFOUND

//Path to a library.
QT_CONTAINEREXTENSION_PLUGIN_DEBUG:FILEPATH=QT_CONTAINEREXTENSION_PLUGIN_DEBUG-NOTFOUND

//Path to a library.
QT_CONTAINEREXTENSION_PLUGIN_RELEASE:FILEPATH=QT_CONTAINEREXTENSION_PLUGIN_RELEASE-NOTFOUND

//Path to a library.
QT_CUSTOMWIDGETPLUGIN_PLUGIN_DEBUG:FILEPATH=QT_CUSTOMWIDGETPLUGIN_PLUGIN_DEBUG-NOTFOUND

//Path to a library.
QT_CUSTOMWIDGETPLUGIN_PLUGIN_RELEASE:FILEPATH=QT_CUSTOMWIDGETPLUGIN_PLUGIN_RELEASE-NOTFOUND

//Path to a program.
QT_DBUSCPP2XML_EXECUTABLE:FILEPATH=/usr/lib/x86_64-linux-gnu/qt4/bin/qdbuscpp2xml

//Path to a program.
QT_DBUSXML2CPP_EXECUTABLE:FILEPATH=/usr/lib/x86_64-linux-gnu/qt4/bin/qdbusxml2cpp

//Path to a program.
QT_DESIGNER_EXECUTABLE:FILEPATH=QT_DESIGNER_EXECUTABLE-NOTFOUND

//The location of the Qt docs
QT_DOC_DIR:PATH=/usr/share/qt4/doc

//Path to a program.
QT_LINGUIST_EXECUTABLE:FILEPATH=QT_LINGUIST_EXECUTABLE-NOTFOUND

//Path to a program.
QT_LRELEASE_EXECUTABLE:FILEPATH=/usr/lib/x86_64-linux-gnu/qt4/bin/lrelease

//Path to a program.
QT_LUPDATE_EXECUTABLE:FILEPATH=/usr/lib/x86_64-linux-gnu/qt4/bin/lupdate

//The location of the Qt mkspecs containing qconfig.pri
QT_MKSPECS_DIR:PATH=/usr/share/qt4/mkspecs

//Path to a program.
QT_MOC_EXECUTABLE:FILEPATH=/usr/lib/x86_64-linux-gnu/qt4/bin/moc

//Path to a library.
QT_PHONONWIDGETS_PLUGIN_DEBUG:FILEPATH=QT_PHONONWIDGETS_PLUGIN_DEBUG-NOTFOUND

//Path to a library.
QT_PHONONWIDGETS_PLUGIN_RELEASE:FILEPATH=QT_PHONONWIDGETS_PLUGIN_RELEASE-NOTFOUND

//Path to a file.
QT_PHONON_INCLUDE_DIR:PATH=QT_PHONON_INCLUDE_DIR-NOTFOUND

//The Qt PHONON library
QT_PHONON_LIBRARY:STRING=

//Path to a library.
QT_PHONON_LIBRARY_DEBUG:FILEPATH=QT_PHONON_LIBRARY_DEBUG-NOTFOUND

//Path to a library.
QT_PHONON_LIBRARY_RELEASE:FILEPATH=QT_PHONON_LIBRARY_RELEASE-NOTFOUND

//The location of the Qt plugins
QT_PLUGINS_DIR:PATH=/usr/lib/x86_64-linux-gnu/qt4/plugins

//Path to a library.
QT_QCNCODECS_PLUGIN_DEBUG:FILEPATH=QT_QCNCODECS_PLUGIN_DEBUG-NOTFOUND

//Path to a library.
QT_QCNCODECS_PLUGIN_RELEASE:FILEPATH=/usr/lib/x86_64-linux-gnu/qt4/plugins/codecs/libqcncodecs.so

//Path to a program.
QT_QCOLLECTIONGENERATOR_EXECUTABLE:FILEPATH=QT_QCOLLECTIONGENERATOR_EXECUTABLE-NOTFOUND

//Path to a library.
QT_QCOREWLANBEARER_PLUGIN_DEBUG:FILEPATH=QT_QCOREWLANBEARER_PLUGIN_DEBUG-NOTFOUND

//Path to a library.
QT_QCOREWLANBEARER_PLUGIN_RELEASE:FILEPATH=QT_QCOREWLANBEARER_PLUGIN_RELEASE-NOTFOUND

//Path to a library.
QT_QDECLARATIVEVIEW_PLUGIN_DEBUG:FILEPATH=QT_QDECLARATIVEVIEW_PLUGIN_DEBUG-NOTFOUND

//Path to a library.
QT_QDECLARATIVEVIEW_PLUGIN_RELEASE:FILEPATH=/usr/lib/x86_64-linux-gnu/qt4/plugins/designer/libqdeclarativeview.so

//Path to a library.
QT_QDECORATIONDEFAULT_PLUGIN_DEBUG:FILEPATH=QT_QDECORATIONDEFAULT_PLUGIN_DEBUG-NOTFOUND

//Path to a library.
QT_QDECORATIONDEFAULT_PLUGIN_RELEASE:FILEPATH=QT_QDECORATIONDEFAULT_PLUGIN_RELEASE-NOTFOUND

//Path to a library.
QT_QDECORATIONWINDOWS_PLUGIN_DEBUG:FILEPATH=QT_QDECORATIONWINDOWS_PLUGIN_DEBUG-NOTFOUND

//Path to a library.
QT_QDECORATIONWINDOWS_PLUGIN_RELEASE:FILEPATH=QT_QDECORATIONWINDOWS_PLUGIN_RELEASE-NOTFOUND

//Path to a library.
QT_QGENERICBEARER_PLUGIN_DEBUG:FILEPATH=QT_QGENERICBEARER_PLUGIN_DEBUG-NOTFOUND

//Path to a library.
QT_QGENERICBEARER_PLUGIN_RELEASE:FILEPATH=/usr/lib/x86_64-linux-gnu/qt4/plugins/bearer/libqgenericbearer.so

//Path to a library.
QT_QGIF_PLUGIN_DEBUG:FILEPATH=QT_QGIF_PLUGIN_DEBUG-NOTFOUND

//Path to a library.
QT_QGIF_PLUGIN_RELEASE:FILEPATH=/usr/lib/x86_64-linux-gnu/qt4/plugins/imageformats/libqgif.so

//Path to a library.
QT_QGLGRAPHICSSYSTEM_PLUGIN_DEBUG:FILEPATH=QT_QGLGRAPHICSSYSTEM_PLUGIN_DEBUG-NOTFOUND

//Path to a library.
QT_QGLGRAPHICSSYSTEM_PLUGIN_RELEASE:FILEPATH=/usr/lib/x86_64-linux-gnu/qt4/plugins/graphicssystems/libqglgraphicssystem.so

//Path to a library.
QT_QICO_PLUGIN_DEBUG:FILEPATH=QT_QICO_PLUGIN_DEBUG-NOTFOUND

//Path to a library.
QT_QICO_PLUGIN_RELEASE:FILEPATH=/usr/lib/x86_64-linux-gnu/qt4/plugins/imageformats/libqico.so

//Path to a library.
QT_QIMSW_MULTI_PLUGIN_DEBUG:FILEPATH=QT_QIMSW_MULTI_PLUGIN_DEBUG-NOTFOUND

//Path to a library.
QT_QIMSW_MULTI_PLUGIN_RELEASE:FILEPATH=QT_QIMSW_MULTI_PLUGIN_RELEASE-NOTFOUND

//Path to a library.
QT_QJPCODECS_PLUGIN_DEBUG:FILEPATH=QT_QJPCODECS_PLUGIN_DEBUG-NOTFOUND

//Path to a library.
QT_QJPCODECS_PLUGIN_RELEASE:FILEPATH=/usr/lib/x86_64-linux-gnu/qt4/plugins/codecs/libqjpcodecs.so

//Path to a library.
QT_QJPEG_PLUGIN_DEBUG:FILEPATH=QT_QJPEG_PLUGIN_DEBUG-NOTFOUND

//Path to a library.
QT_QJPEG_PLUGIN_RELEASE:FILEPATH=/usr/lib/x86_64-linux-gnu/qt4/plugins/imageformats/libqjpeg.so

//Path to a library.
QT_QKRCODECS_PLUGIN_DEBUG:FILEPATH=QT_QKRCODECS_PLUGIN_DEBUG-NOTFOUND

//Path to a library.
QT_QKRCODECS_PLUGIN_RELEASE:FILEPATH=/usr/lib/x86_64-linux-gnu/qt4/plugins/codecs/libqkrcodecs.so

//Where can the qmake-qt4 library be found
QT_QMAKE_EXECUTABLE:FILEPATH=/usr/bin/qmake-qt4

//Path to a library.
QT_QMNG_PLUGIN_DEBUG:FILEPATH=QT_QMNG_PLUGIN_DEBUG-NOTFOUND

//Path to a library.
QT_QMNG_PLUGIN_RELEASE:FILEPATH=/usr/lib/x86_64-linux-gnu/qt4/plugins/imageformats/libqmng.so

//Path to a library.
QT_QSQLDB2_PLUGIN_DEBUG:FILEPATH=QT_QSQLDB2_PLUGIN_DEBUG-NOTFOUND

//Path to a library.
QT_QSQLDB2_PLUGIN_RELEASE:FILEPATH=QT_QSQLDB2_PLUGIN_RELEASE-NOTFOUND

//Path to a library.
QT_QSQLIBASE_PLUGIN_DEBUG:FILEPATH=QT_QSQLIBASE_PLUGIN_DEBUG-NOTFOUND

//Path to a library.
QT_QSQLIBASE_PLUGIN_RELEASE:FILEPATH=QT_QSQLIBASE_PLUGIN_RELEASE-NOTFOUND

//Path to a library.
QT_QSQLITE2_PLUGIN_DEBUG:FILEPATH=QT_QSQLITE2_PLUGIN_DEBUG-NOTFOUND

//Path to a library.
QT_QSQLITE2_PLUGIN_RELEASE:FILEPATH=QT_QSQLITE2_PLUGIN_RELEASE-NOTFOUND

//Path to a library.
QT_QSQLITE_PLUGIN_DEBUG:FILEPATH=QT_QSQLITE_PLUGIN_DEBUG-NOTFOUND

//Path to a library.
QT_QSQLITE_PLUGIN_RELEASE:FILEPATH=/usr/lib/x86_64-linux-gnu/qt4/plugins/sqldrivers/libqsqlite.so

//Path to a library.
QT_QSQLMYSQL_PLUGIN_DEBUG:FILEPATH=QT_QSQLMYSQL_PLUGIN_DEBUG-NOTFOUND

//Path to a library.
QT_QSQLMYSQL_PLUGIN_RELEASE:FILEPATH=QT_QSQLMYSQL_PLUGIN_RELEASE-NOTFOUND

//Path to a library.
QT_QSQLOCI_PLUGIN_DEBUG:FILEPATH=QT_QSQLOCI_PLUGIN_DEBUG-NOTFOUND

//Path to a library.
QT_QSQLOCI_PLUGIN_RELEASE:FILEPATH=QT_QSQLOCI_PLUGIN_RELEASE-NOTFOUND

//Path to a library.
QT_QSQLODBC_PLUGIN_DEBUG:FILEPATH=QT_QSQLODBC_PLUGIN_DEBUG-NOTFOUND

//Path to a library.
QT_QSQLODBC_PLUGIN_RELEASE:FILEPATH=QT_QSQLODBC_PLUGIN_RELEASE-NOTFOUND

//Path to a library.
QT_QSQLPSQL_PLUGIN_DEBUG:FILEPATH=QT_QSQLPSQL_PLUGIN_DEBUG-NOTFOUND

//Path to a library.
QT_QSQLPSQL_PLUGIN_RELEASE:FILEPATH=QT_QSQLPSQL_PLUGIN_RELEASE-NOTFOUND

//Path to a library.
QT_QSQLTDS_PLUGIN_DEBUG:FILEPATH=QT_QSQLTDS_PLUGIN_DEBUG-NOTFOUND

//Path to a library.
QT_QSQLTDS_PLUGIN_RELEASE:FILEPATH=QT_QSQLTDS_PLUGIN_RELEASE-NOTFOUND

//Path to a library.
QT_QSVGICON_PLUGIN_DEBUG:FILEPATH=QT_QSVGICON_PLUGIN_DEBUG-NOTFOUND

//Path to a library.
QT_QSVGICON_PLUGIN_RELEASE:FILEPATH=/usr/lib/x86_64-linux-gnu/qt4/plugins/iconengines/libqsvgicon.so

//Path to a library.
QT_QSVG_PLUGIN_DEBUG:FILEPATH=QT_QSVG_PLUGIN_DEBUG-NOTFOUND

//Path to a library.
QT_QSVG_PLUGIN_RELEASE:FILEPATH=/usr/lib/x86_64-linux-gnu/qt4/plugins/imageformats/libqsvg.so

//Path to a library.
QT_QT3SUPPORTWIDGETS_PLUGIN_DEBUG:FILEPATH=QT_QT3SUPPORTWIDGETS_PLUGIN_DEBUG-NOTFOUND

//Path to a library.
QT_QT3SUPPORTWIDGETS_PLUGIN_RELEASE:FILEPATH=/usr/lib/x86_64-linux-gnu/qt4/plugins/designer/libqt3supportwidgets.so

//Path to a file.
QT_QT3SUPPORT_INCLUDE_DIR:PATH=/usr/include/qt4/Qt3Support

//The Qt QT3SUPPORT library
QT_QT3SUPPORT_LIBRARY:STRING=/usr/lib/x86_64-linux-gnu/libQt3Support.so

//Path to a library.
QT_QT3SUPPORT_LIBRARY_DEBUG:FILEPATH=QT_QT3SUPPORT_LIBRARY_DEBUG-NOTFOUND

//Path to a library.
QT_QT3SUPPORT_LIBRARY_RELEASE:FILEPATH=/usr/lib/x86_64-linux-gnu/libQt3Support.so

//Path to a library.
QT_QTACCESSIBLECOMPATWIDGETS_PLUGIN_DEBUG:FILEPATH=QT_QTACCESSIBLECOMPATWIDGETS_PLUGIN_DEBUG-NOTFOUND

//Path to a library.
QT_QTACCESSIBLECOMPATWIDGETS_PLUGIN_RELEASE:FILEPATH=/usr/lib/x86_64-linux-gnu/qt4/plugins/accessible/libqtaccessiblecompatwidgets.so

//Path to a library.
QT_QTACCESSIBLEWIDGETS_PLUGIN_DEBUG:FILEPATH=QT_QTACCESSIBLEWIDGETS_PLUGIN_DEBUG-NOTFOUND

//Path to a library.
QT_QTACCESSIBLEWIDGETS_PLUGIN_RELEASE:FILEPATH=/usr/lib/x86_64-linux-gnu/qt4/plugins/accessible/libqtaccessiblewidgets.so

//Path to a file.
QT_QTASSISTANTCLIENT_INCLUDE_DIR:PATH=QT_QTASSISTANTCLIENT_INCLUDE_DIR-NOTFOUND

//The Qt QTASSISTANTCLIENT library
QT_QTASSISTANTCLIENT_LIBRARY:STRING=

//Path to a library.
QT_QTASSISTANTCLIENT_LIBRARY_DEBUG:FILEPATH=QT_QTASSISTANTCLIENT_LIBRARY_DEBUG-NOTFOUND

//Path to a library.
QT_QTASSISTANTCLIENT_LIBRARY_RELEASE:FILEPATH=QT_QTASSISTANTCLIENT_LIBRARY_RELEASE-NOTFOUND

//Path to a file.
QT_QTASSISTANT_INCLUDE_DIR:PATH=QT_QTASSISTANT_INCLUDE_DIR-NOTFOUND

//The Qt QTASSISTANT library
QT_QTASSISTANT_LIBRARY:STRING=

//Path to a library.
QT_QTASSISTANT_LIBRARY_DEBUG:FILEPATH=QT_QTASSISTANT_LIBRARY_DEBUG-NOTFOUND

//Path to a library.
QT_QTASSISTANT_LIBRARY_RELEASE:FILEPATH=QT_QTASSISTANT_LIBRARY_RELEASE-NOTFOUND

//The Qt QTCLUCENE library
QT_QTCLUCENE_LIBRARY:STRING=/usr/lib/x86_64-linux-gnu/libQtCLucene.so

//Path to a library.
QT_QTCLUCENE_LIBRARY_DEBUG:FILEPATH=QT_QTCLUCENE_LIBRARY_DEBUG-NOTFOUND

//Path to a library.
QT_QTCLUCENE_LIBRARY_RELEASE:FILEPATH=/usr/lib/x86_64-linux-gnu/libQtCLucene.so

//Path to a file.
QT_QTCORE_INCLUDE_DIR:PATH=/usr/include/qt4/QtCore

//The Qt QTCORE library
QT_QTCORE_LIBRARY:STRING=/usr/lib/x86_64-linux-gnu/libQtCore.so

//Path to a library.
QT_QTCORE_LIBRARY_DEBUG:FILEPATH=QT_QTCORE_LIBRARY_DEBUG-NOTFOUND

//Path to a library.
QT_QTCORE_LIBRARY_RELEASE:FILEPATH=/usr/lib/x86_64-linux-gnu/libQtCore.so

//Path to a file.
QT_QTDBUS_INCLUDE_DIR:PATH=/usr/include/qt4/QtDBus

//The Qt QTDBUS library
QT_QTDBUS_LIBRARY:STRING=/usr/lib/x86_64-linux-gnu/libQtDBus.so

//Path to a library.
QT_QTDBUS_LIBRARY_DEBUG:FILEPATH=QT_QTDBUS_LIBRARY_DEBUG-NOTFOUND

//Path to a library.
QT_QTDBUS_LIBRARY_RELEASE:FILEPATH=/usr/lib/x86_64-linux-gnu/libQtDBus.so

//Path to a file.
QT_QTDECLARATIVE_INCLUDE_DIR:PATH=/usr/include/qt4/QtDeclarative

//The Qt QTDECLARATIVE library
QT_QTDECLARATIVE_LIBRARY:STRING=/usr/lib/x86_64-linux-gnu/libQtDeclarative.so

//Path to a library.
QT_QTDECLARATIVE_LIBRARY_DEBUG:FILEPATH=QT_QTDECLARATIVE_LIBRARY_DEBUG-NOTFOUND

//Path to a library.
QT_QTDECLARATIVE_LIBRARY_RELEASE:FILEPATH=/usr/lib/x86_64-linux-gnu/libQtDeclarative.so

//Path to a file.
QT_QTDESIGNERCOMPONENTS_INCLUDE_DIR:PATH=/usr/include/qt4/QtDesigner

//The Qt QTDESIGNERCOMPONENTS library
QT_QTDESIGNERCOMPONENTS_LIBRARY:STRING=/usr/lib/x86_64-linux-gnu/libQtDesignerComponents.so

//Path to a library.
QT_QTDESIGNERCOMPONENTS_LIBRARY_DEBUG:FILEPATH=QT_QTDESIGNERCOMPONENTS_LIBRARY_DEBUG-NOTFOUND

//Path to a library.
QT_QTDESIGNERCOMPONENTS_LIBRARY_RELEASE:FILEPATH=/usr/lib/x86_64-linux-gnu/libQtDesignerComponents.so

//Path to a file.
QT_QTDESIGNER_INCLUDE_DIR:PATH=/usr/include/qt4/QtDesigner

//The Qt QTDESIGNER library
QT_QTDESIGNER_LIBRARY:STRING=/usr/lib/x86_64-linux-gnu/libQtDesigner.so

//Path to a library.
QT_QTDESIGNER_LIBRARY_DEBUG:FILEPATH=QT_QTDESIGNER_LIBRARY_DEBUG-NOTFOUND

//Path to a library.
QT_QTDESIGNER_LIBRARY_RELEASE:FILEPATH=/usr/lib/x86_64-linux-gnu/libQtDesigner.so

//Path to a file.
QT_QTGUI_INCLUDE_DIR:PATH=/usr/include/qt4/QtGui

//The Qt QTGUI library
QT_QTGUI_LIBRARY:STRING=/usr/lib/x86_64-linux-gnu/libQtGui.so

//Path to a library.
QT_QTGUI_LIBRARY_DEBUG:FILEPATH=QT_QTGUI_LIBRARY_DEBUG-NOTFOUND

//Path to a library.
QT_QTGUI_LIBRARY_RELEASE:FILEPATH=/usr/lib/x86_64-linux-gnu/libQtGui.so

//Path to a file.
QT_QTHELP_INCLUDE_DIR:PATH=/usr/include/qt4/QtHelp

//The Qt QTHELP library
QT_QTHELP_LIBRARY:STRING=/usr/lib/x86_64-linux-gnu/libQtHelp.so

//Path to a library.
QT_QTHELP_LIBRARY_DEBUG:FILEPATH=QT_QTHELP_LIBRARY_DEBUG-NOTFOUND

//Path to a library.
QT_QTHELP_LIBRARY_RELEASE:FILEPATH=/usr/lib/x86_64-linux-gnu/libQtHelp.so

//Path to a library.
QT_QTIFF_PLUGIN_DEBUG:FILEPATH=QT_QTIFF_PLUGIN_DEBUG-NOTFOUND

//Path to a library.
QT_QTIFF_PLUGIN_RELEASE:FILEPATH=/usr/lib/x86_64-linux-gnu/qt4/plugins/imageformats/libqtiff.so

//Path to a file.
QT_QTMOTIF_INCLUDE_DIR:PATH=QT_QTMOTIF_INCLUDE_DIR-NOTFOUND

//The Qt QTMOTIF library
QT_QTMOTIF_LIBRARY:STRING=

//Path to a library.
QT_QTMOTIF_LIBRARY_DEBUG:FILEPATH=QT_QTMOTIF_LIBRARY_DEBUG-NOTFOUND

//Path to a library.
QT_QTMOTIF_LIBRARY_RELEASE:FILEPATH=QT_QTMOTIF_LIBRARY_RELEASE-NOTFOUND

//Path to a file.
QT_QTMULTIMEDIA_INCLUDE_DIR:PATH=QT_QTMULTIMEDIA_INCLUDE_DIR-NOTFOUND

//The Qt QTMULTIMEDIA library
QT_QTMULTIMEDIA_LIBRARY:STRING=

//Path to a library.
QT_QTMULTIMEDIA_LIBRARY_DEBUG:FILEPATH=QT_QTMULTIMEDIA_LIBRARY_DEBUG-NOTFOUND

//Path to a library.
QT_QTMULTIMEDIA_LIBRARY_RELEASE:FILEPATH=QT_QTMULTIMEDIA_LIBRARY_RELEASE-NOTFOUND

//Path to a file.
QT_QTNETWORK_INCLUDE_DIR:PATH=/usr/include/qt4/QtNetwork

//The Qt QTNETWORK library
QT_QTNETWORK_LIBRARY:STRING=/usr/lib/x86_64-linux-gnu/libQtNetwork.so

//Path to a library.
QT_QTNETWORK_LIBRARY_DEBUG:FILEPATH=QT_QTNETWORK_LIBRARY_DEBUG-NOTFOUND

//Path to a library.
QT_QTNETWORK_LIBRARY_RELEASE:FILEPATH=/usr/lib/x86_64-linux-gnu/libQtNetwork.so

//Path to a file.
QT_QTNSPLUGIN_INCLUDE_DIR:PATH=QT_QTNSPLUGIN_INCLUDE_DIR-NOTFOUND

//The Qt QTNSPLUGIN library
QT_QTNSPLUGIN_LIBRARY:STRING=

//Path to a library.
QT_QTNSPLUGIN_LIBRARY_DEBUG:FILEPATH=QT_QTNSPLUGIN_LIBRARY_DEBUG-NOTFOUND

//Path to a library.
QT_QTNSPLUGIN_LIBRARY_RELEASE:FILEPATH=QT_QTNSPLUGIN_LIBRARY_RELEASE-NOTFOUND

//Path to a file.
QT_QTOPENGL_INCLUDE_DIR:PATH=/usr/include/qt4/QtOpenGL

//The Qt QTOPENGL library
QT_QTOPENGL_LIBRARY:STRING=/usr/lib/x86_64-linux-gnu/libQtOpenGL.so

//Path to a library.
QT_QTOPENGL_LIBRARY_DEBUG:FILEPATH=QT_QTOPENGL_LIBRARY_DEBUG-NOTFOUND

//Path to a library.
QT_QTOPENGL_LIBRARY_RELEASE:FILEPATH=/usr/lib/x86_64-linux-gnu/libQtOpenGL.so

//Path to a library.
QT_QTRACEGRAPHICSSYSTEM_PLUGIN_DEBUG:FILEPATH=QT_QTRACEGRAPHICSSYSTEM_PLUGIN_DEBUG-NOTFOUND

//Path to a library.
QT_QTRACEGRAPHICSSYSTEM_PLUGIN_RELEASE:FILEPATH=/usr/lib/x86_64-linux-gnu/qt4/plugins/graphicssystems/libqtracegraphicssystem.so

//Path to a library.
QT_QTSCRIPTDBUS_PLUGIN_DEBUG:FILEPATH=QT_QTSCRIPTDBUS_PLUGIN_DEBUG-NOTFOUND

//Path to a library.
QT_QTSCRIPTDBUS_PLUGIN_RELEASE:FILEPATH=/usr/lib/x86_64-linux-gnu/qt4/plugins/script/libqtscriptdbus.so

//Path to a file.
QT_QTSCRIPTTOOLS_INCLUDE_DIR:PATH=/usr/include/qt4/QtScriptTools

//The Qt QTSCRIPTTOOLS library
QT_QTSCRIPTTOOLS_LIBRARY:STRING=/usr/lib/x86_64-linux-gnu/libQtScriptTools.so

//Path to a library.
QT_QTSCRIPTTOOLS_LIBRARY_DEBUG:FILEPATH=QT_QTSCRIPTTOOLS_LIBRARY_DEBUG-NOTFOUND

//Path to a library.
QT_QTSCRIPTTOOLS_LIBRARY_RELEASE:FILEPATH=/usr/lib/x86_64-linux-gnu/libQtScriptTools.so

//Path to a file.
QT_QTSCRIPT_INCLUDE_DIR:PATH=/usr/include/qt4/QtScript

//The Qt QTSCRIPT library
QT_QTSCRIPT_LIBRARY:STRING=/usr/lib/x86_64-linux-gnu/libQtScript.so

//Path to a library.
QT_QTSCRIPT_LIBRARY_DEBUG:FILEPATH=QT_QTSCRIPT_LIBRARY_DEBUG-NOTFOUND

//Path to a library.
QT_QTSCRIPT_LIBRARY_RELEASE:FILEPATH=/usr/lib/x86_64-linux-gnu/libQtScript.so

//Path to a file.
QT_QTSQL_INCLUDE_DIR:PATH=/usr/include/qt4/QtSql

//The Qt QTSQL library
QT_QTSQL_LIBRARY:STRING=/usr/lib/x86_64-linux-gnu/libQtSql.so

//Path to a library.
QT_QTSQL_LIBRARY_DEBUG:FILEPATH=QT_QTSQL_LIBRARY_DEBUG-NOTFOUND

//Path to a library.
QT_QTSQL_LIBRARY_RELEASE:FILEPATH=/usr/lib/x86_64-linux-gnu/libQtSql.so

//Path to a file.
QT_QTSVG_INCLUDE_DIR:PATH=/usr/include/qt4/QtSvg

//The Qt QTSVG library
QT_QTSVG_LIBRARY:STRING=/usr/lib/x86_64-linux-gnu/libQtSvg.so

//Path to a library.
QT_QTSVG_LIBRARY_DEBUG:FILEPATH=QT_QTSVG_LIBRARY_DEBUG-NOTFOUND

//Path to a library.
QT_QTSVG_LIBRARY_RELEASE:FILEPATH=/usr/lib/x86_64-linux-gnu/libQtSvg.so

//Path to a file.
QT_QTTEST_INCLUDE_DIR:PATH=/usr/include/qt4/QtTest

//The Qt QTTEST library
QT_QTTEST_LIBRARY:STRING=/usr/lib/x86_64-linux-gnu/libQtTest.so

//Path to a library.
QT_QTTEST_LIBRARY_DEBUG:FILEPATH=QT_QTTEST_LIBRARY_DEBUG-NOTFOUND

//Path to a library.
QT_QTTEST_LIBRARY_RELEASE:FILEPATH=/usr/lib/x86_64-linux-gnu/libQtTest.so

//Path to a file.
QT_QTUITOOLS_INCLUDE_DIR:PATH=/usr/include/qt4/QtUiTools

//The Qt QTUITOOLS library
QT_QTUITOOLS_LIBRARY:STRING=/usr/lib/x86_64-linux-gnu/libQtUiTools.a

//Path to a library.
QT_QTUITOOLS_LIBRARY_DEBUG:FILEPATH=QT_QTUITOOLS_LIBRARY_DEBUG-NOTFOUND

//Path to a library.
QT_QTUITOOLS_LIBRARY_RELEASE:FILEPATH=/usr/lib/x86_64-linux-gnu/libQtUiTools.a

//Path to a library.
QT_QTWCODECS_PLUGIN_DEBUG:FILEPATH=QT_QTWCODECS_PLUGIN_DEBUG-NOTFOUND

//Path to a library.
QT_QTWCODECS_PLUGIN_RELEASE:FILEPATH=/usr/lib/x86_64-linux-gnu/qt4/plugins/codecs/libqtwcodecs.so

//Path to a file.
QT_QTWEBKIT_INCLUDE_DIR:PATH=/usr/include/qt4/QtWebKit

//The Qt QTWEBKIT library
QT_QTWEBKIT_LIBRARY:STRING=/usr/lib/x86_64-linux-gnu/libQtWebKit.so

//Path to a library.
QT_QTWEBKIT_LIBRARY_DEBUG:FILEPATH=QT_QTWEBKIT_LIBRARY_DEBUG-NOTFOUND

//Path to a library.
QT_QTWEBKIT_LIBRARY_RELEASE:FILEPATH=/usr/lib/x86_64-linux-gnu/libQtWebKit.so

//Path to a file.
QT_QTXMLPATTERNS_INCLUDE_DIR:PATH=/usr/include/qt4/QtXmlPatterns

//The Qt QTXMLPATTERNS library
QT_QTXMLPATTERNS_LIBRARY:STRING=/usr/lib/x86_64-linux-gnu/libQtXmlPatterns.so

//Path to a library.
QT_QTXMLPATTERNS_LIBRARY_DEBUG:FILEPATH=QT_QTXMLPATTERNS_LIBRARY_DEBUG-NOTFOUND

//Path to a library.
QT_QTXMLPATTERNS_LIBRARY_RELEASE:FILEPATH=/usr/lib/x86_64-linux-gnu/libQtXmlPatterns.so

//Path to a file.
QT_QTXML_INCLUDE_DIR:PATH=/usr/include/qt4/QtXml

//The Qt QTXML library
QT_QTXML_LIBRARY:STRING=/usr/lib/x86_64-linux-gnu/libQtXml.so

//Path to a library.
QT_QTXML_LIBRARY_DEBUG:FILEPATH=QT_QTXML_LIBRARY_DEBUG-NOTFOUND

//Path to a library.
QT_QTXML_LIBRARY_RELEASE:FILEPATH=/usr/lib/x86_64-linux-gnu/libQtXml.so

//Path to a library.
QT_QWEBVIEW_PLUGIN_DEBUG:FILEPATH=QT_QWEBVIEW_PLUGIN_DEBUG-NOTFOUND

//Path to a library.
QT_QWEBVIEW_PLUGIN_RELEASE:FILEPATH=QT_QWEBVIEW_PLUGIN_RELEASE-NOTFOUND

//Path to a library.
QT_QWSTSLIBMOUSEHANDLER_PLUGIN_DEBUG:FILEPATH=QT_QWSTSLIBMOUSEHANDLER_PLUGIN_DEBUG-NOTFOUND

//Path to a library.
QT_QWSTSLIBMOUSEHANDLER_PLUGIN_RELEASE:FILEPATH=QT_QWSTSLIBMOUSEHANDLER_PLUGIN_RELEASE-NOTFOUND

//Path to a program.
QT_RCC_EXECUTABLE:FILEPATH=/usr/lib/x86_64-linux-gnu/qt4/bin/rcc

//Path to a library.
QT_TASKMENUEXTENSION_PLUGIN_DEBUG:FILEPATH=QT_TASKMENUEXTENSION_PLUGIN_DEBUG-NOTFOUND

//Path to a library.
QT_TASKMENUEXTENSION_PLUGIN_RELEASE:FILEPATH=QT_TASKMENUEXTENSION_PLUGIN_RELEASE-NOTFOUND

//The location of the Qt translations
QT_TRANSLATIONS_DIR:PATH=/usr/share/qt4/translations

//Path to a program.
QT_UIC3_EXECUTABLE:FILEPATH=/usr/lib/x86_64-linux-gnu/qt4/bin/uic3

//Path to a program.
QT_UIC_EXECUTABLE:FILEPATH=/usr/lib/x86_64-linux-gnu/qt4/bin/uic

//Path to a library.
QT_WORLDTIMECLOCKPLUGIN_PLUGIN_DEBUG:FILEPATH=QT_WORLDTIMECLOCKPLUGIN_PLUGIN_DEBUG-NOTFOUND

//Path to a library.
QT_WORLDTIMECLOCKPLUGIN_PLUGIN_RELEASE:FILEPATH=QT_WORLDTIMECLOCKPLUGIN_PLUGIN_RELEASE-NOTFOUND

//Path to a file.
QVTK_INCLUDE_DIR:PATH=/usr/include

//Path to a library.
QVTK_LIBRARY:FILEPATH=/usr/lib/libQVTK.so

//Sphinx documentation generator
SPHINX_EXECUTABLE:FILEPATH=/usr/local/bin/sphinx-build

//Suffix (extension) of the HTML files generated by Sphinx
SPHINX_HTML_FILE_SUFFIX:STRING=html

//Path to a file.
USB_10_INCLUDE_DIR:PATH=/usr/include

//Path to a library.
USB_10_LIBRARY:FILEPATH=/usr/lib/x86_64-linux-gnu/libusb-1.0.so

//Use folders to organize PCL projects in an IDE.
USE_PROJECT_FOLDERS:BOOL=OFF

//Use UmfPack for solving sparse systems of equations (e.g. in
// surface/on_nurbs)
USE_UMFPACK:BOOL=OFF

//The directory containing a CMake configuration file for VTK.
VTK_DIR:PATH=/usr/lib/vtk-5.8

//Build doxygen documentation
WITH_DOCS:BOOL=ON

//Build Fotonic Camera support
WITH_FZAPI:BOOL=ON

//Build USB RGBD-Camera drivers
WITH_LIBUSB:BOOL=ON

//OpenNI driver support
WITH_OPENNI:BOOL=ON

//OpenNI 2 driver support
WITH_OPENNI2:BOOL=ON

//pcap file capabilities in Velodyne HDL driver
WITH_PCAP:BOOL=ON

//PNG file support
WITH_PNG:BOOL=ON

//Build PXC Device support
WITH_PXCAPI:BOOL=ON

//Include convex-hull operations
WITH_QHULL:BOOL=ON

//Build QT Front-End
WITH_QT:BOOL=ON

//Build tutorials (requires Sphinx)
WITH_TUTORIALS:BOOL=ON

//Build VTK-Visualizations
WITH_VTK:BOOL=ON

//Path to a file.
X11_ICE_INCLUDE_PATH:PATH=/usr/include

//Path to a library.
X11_ICE_LIB:FILEPATH=/usr/lib/x86_64-linux-gnu/libICE.so

//Path to a file.
X11_SM_INCLUDE_PATH:PATH=/usr/include

//Path to a library.
X11_SM_LIB:FILEPATH=/usr/lib/x86_64-linux-gnu/libSM.so

//Path to a file.
X11_X11_INCLUDE_PATH:PATH=/usr/include

//Path to a library.
X11_X11_LIB:FILEPATH=/usr/lib/x86_64-linux-gnu/libX11.so

//Path to a file.
X11_XRes_INCLUDE_PATH:PATH=X11_XRes_INCLUDE_PATH-NOTFOUND

//Path to a library.
X11_XRes_LIB:FILEPATH=X11_XRes_LIB-NOTFOUND

//Path to a file.
X11_XShm_INCLUDE_PATH:PATH=/usr/include

//Path to a file.
X11_XSync_INCLUDE_PATH:PATH=/usr/include

//Path to a file.
X11_XTest_INCLUDE_PATH:PATH=X11_XTest_INCLUDE_PATH-NOTFOUND

//Path to a library.
X11_XTest_LIB:FILEPATH=X11_XTest_LIB-NOTFOUND

//Path to a file.
X11_Xaccessrules_INCLUDE_PATH:PATH=X11_Xaccessrules_INCLUDE_PATH-NOTFOUND

//Path to a file.
X11_Xaccessstr_INCLUDE_PATH:PATH=/usr/include

//Path to a file.
X11_Xau_INCLUDE_PATH:PATH=/usr/include

//Path to a library.
X11_Xau_LIB:FILEPATH=/usr/lib/x86_64-linux-gnu/libXau.so

//Path to a file.
X11_Xcomposite_INCLUDE_PATH:PATH=/usr/include

//Path to a library.
X11_Xcomposite_LIB:FILEPATH=/usr/lib/x86_64-linux-gnu/libXcomposite.so

//Path to a file.
X11_Xcursor_INCLUDE_PATH:PATH=/usr/include

//Path to a library.
X11_Xcursor_LIB:FILEPATH=/usr/lib/x86_64-linux-gnu/libXcursor.so

//Path to a file.
X11_Xdamage_INCLUDE_PATH:PATH=/usr/include

//Path to a library.
X11_Xdamage_LIB:FILEPATH=/usr/lib/x86_64-linux-gnu/libXdamage.so

//Path to a file.
X11_Xdmcp_INCLUDE_PATH:PATH=/usr/include

//Path to a library.
X11_Xdmcp_LIB:FILEPATH=/usr/lib/x86_64-linux-gnu/libXdmcp.so

//Path to a library.
X11_Xext_LIB:FILEPATH=/usr/lib/x86_64-linux-gnu/libXext.so

//Path to a file.
X11_Xfixes_INCLUDE_PATH:PATH=/usr/include

//Path to a library.
X11_Xfixes_LIB:FILEPATH=/usr/lib/x86_64-linux-gnu/libXfixes.so

//Path to a file.
X11_Xft_INCLUDE_PATH:PATH=/usr/include

//Path to a library.
X11_Xft_LIB:FILEPATH=/usr/lib/x86_64-linux-gnu/libXft.so

//Path to a file.
X11_Xi_INCLUDE_PATH:PATH=/usr/include

//Path to a library.
X11_Xi_LIB:FILEPATH=/usr/lib/x86_64-linux-gnu/libXi.so

//Path to a file.
X11_Xinerama_INCLUDE_PATH:PATH=/usr/include

//Path to a library.
X11_Xinerama_LIB:FILEPATH=/usr/lib/x86_64-linux-gnu/libXinerama.so

//Path to a file.
X11_Xinput_INCLUDE_PATH:PATH=/usr/include

//Path to a library.
X11_Xinput_LIB:FILEPATH=/usr/lib/x86_64-linux-gnu/libXi.so

//Path to a file.
X11_Xkb_INCLUDE_PATH:PATH=/usr/include

//Path to a file.
X11_Xkbfile_INCLUDE_PATH:PATH=X11_Xkbfile_INCLUDE_PATH-NOTFOUND

//Path to a library.
X11_Xkbfile_LIB:FILEPATH=X11_Xkbfile_LIB-NOTFOUND

//Path to a file.
X11_Xkblib_INCLUDE_PATH:PATH=/usr/include

//Path to a file.
X11_Xlib_INCLUDE_PATH:PATH=/usr/include

//Path to a file.
X11_Xmu_INCLUDE_PATH:PATH=/usr/include

//Path to a library.
X11_Xmu_LIB:FILEPATH=/usr/lib/x86_64-linux-gnu/libXmu.so

//Path to a file.
X11_Xpm_INCLUDE_PATH:PATH=X11_Xpm_INCLUDE_PATH-NOTFOUND

//Path to a library.
X11_Xpm_LIB:FILEPATH=X11_Xpm_LIB-NOTFOUND

//Path to a file.
X11_Xrandr_INCLUDE_PATH:PATH=/usr/include

//Path to a library.
X11_Xrandr_LIB:FILEPATH=/usr/lib/x86_64-linux-gnu/libXrandr.so

//Path to a file.
X11_Xrender_INCLUDE_PATH:PATH=/usr/include

//Path to a library.
X11_Xrender_LIB:FILEPATH=/usr/lib/x86_64-linux-gnu/libXrender.so

//Path to a file.
X11_Xscreensaver_INCLUDE_PATH:PATH=/usr/include

//Path to a library.
X11_Xscreensaver_LIB:FILEPATH=/usr/lib/x86_64-linux-gnu/libXss.so

//Path to a file.
X11_Xshape_INCLUDE_PATH:PATH=/usr/include

//Path to a file.
X11_Xt_INCLUDE_PATH:PATH=/usr/include

//Path to a library.
X11_Xt_LIB:FILEPATH=/usr/lib/x86_64-linux-gnu/libXt.so

//Path to a file.
X11_Xutil_INCLUDE_PATH:PATH=/usr/include

//Path to a file.
X11_Xv_INCLUDE_PATH:PATH=X11_Xv_INCLUDE_PATH-NOTFOUND

//Path to a library.
X11_Xv_LIB:FILEPATH=X11_Xv_LIB-NOTFOUND

//Path to a library.
X11_Xxf86misc_LIB:FILEPATH=X11_Xxf86misc_LIB-NOTFOUND

//Path to a library.
X11_Xxf86vm_LIB:FILEPATH=/usr/lib/x86_64-linux-gnu/libXxf86vm.so

//Path to a file.
X11_dpms_INCLUDE_PATH:PATH=/usr/include

//Path to a file.
X11_xf86misc_INCLUDE_PATH:PATH=X11_xf86misc_INCLUDE_PATH-NOTFOUND

//Path to a file.
X11_xf86vmode_INCLUDE_PATH:PATH=/usr/include

//Path to a file.
ZLIB_INCLUDE_DIR:PATH=/usr/include

//Path to a library.
ZLIB_LIBRARY:FILEPATH=/usr/lib/x86_64-linux-gnu/libz.so

//Dependencies for the target
pcl_apps_LIB_DEPENDS:STATIC=general;/usr/lib/x86_64-linux-gnu/libboost_system.so;general;/usr/lib/x86_64-linux-gnu/libboost_filesystem.so;general;/usr/lib/x86_64-linux-gnu/libboost_thread.so;general;/usr/lib/x86_64-linux-gnu/libboost_date_time.so;general;/usr/lib/x86_64-linux-gnu/libboost_iostreams.so;general;/usr/lib/x86_64-linux-gnu/libboost_chrono.so;general;/usr/lib/x86_64-linux-gnu/libpthread.so;general;m;general;pcl_common;general;pcl_io;general;pcl_filters;general;pcl_visualization;general;pcl_segmentation;general;pcl_surface;general;pcl_features;general;pcl_sample_consensus;general;pcl_search;

//Value Computed by CMake
pcl_cc_tool_euclidean_clustering_BINARY_DIR:STATIC=/home/dell/pcl-1.7.2rc1.1/build/apps/cloud_composer

//Dependencies for the target
pcl_cc_tool_euclidean_clustering_LIB_DEPENDS:STATIC=general;/usr/lib/x86_64-linux-gnu/libboost_system.so;general;/usr/lib/x86_64-linux-gnu/libboost_filesystem.so;general;/usr/lib/x86_64-linux-gnu/libboost_thread.so;general;/usr/lib/x86_64-linux-gnu/libboost_date_time.so;general;/usr/lib/x86_64-linux-gnu/libboost_iostreams.so;general;/usr/lib/x86_64-linux-gnu/libboost_chrono.so;general;/usr/lib/x86_64-linux-gnu/libpthread.so;general;m;general;pcl_cc_tool_interface;general;pcl_common;general;pcl_io;general;pcl_segmentation;general;pcl_kdtree;general;/usr/lib/x86_64-linux-gnu/libQtGui.so;general;/usr/lib/x86_64-linux-gnu/libQtCore.so;

//Value Computed by CMake
pcl_cc_tool_euclidean_clustering_SOURCE_DIR:STATIC=/home/dell/pcl-1.7.2rc1.1/apps/cloud_composer

//Value Computed by CMake
pcl_cc_tool_fpfh_estimation_BINARY_DIR:STATIC=/home/dell/pcl-1.7.2rc1.1/build/apps/cloud_composer

//Dependencies for the target
pcl_cc_tool_fpfh_estimation_LIB_DEPENDS:STATIC=general;/usr/lib/x86_64-linux-gnu/libboost_system.so;general;/usr/lib/x86_64-linux-gnu/libboost_filesystem.so;general;/usr/lib/x86_64-linux-gnu/libboost_thread.so;general;/usr/lib/x86_64-linux-gnu/libboost_date_time.so;general;/usr/lib/x86_64-linux-gnu/libboost_iostreams.so;general;/usr/lib/x86_64-linux-gnu/libboost_chrono.so;general;/usr/lib/x86_64-linux-gnu/libpthread.so;general;m;general;pcl_cc_tool_interface;general;pcl_common;general;pcl_io;general;pcl_features;general;pcl_kdtree;general;pcl_filters;general;/usr/lib/x86_64-linux-gnu/libQtGui.so;general;/usr/lib/x86_64-linux-gnu/libQtCore.so;

//Value Computed by CMake
pcl_cc_tool_fpfh_estimation_SOURCE_DIR:STATIC=/home/dell/pcl-1.7.2rc1.1/apps/cloud_composer

//Dependencies for the target
pcl_cc_tool_interface_LIB_DEPENDS:STATIC=general;/usr/lib/x86_64-linux-gnu/libboost_system.so;general;/usr/lib/x86_64-linux-gnu/libboost_filesystem.so;general;/usr/lib/x86_64-linux-gnu/libboost_thread.so;general;/usr/lib/x86_64-linux-gnu/libboost_date_time.so;general;/usr/lib/x86_64-linux-gnu/libboost_iostreams.so;general;/usr/lib/x86_64-linux-gnu/libboost_chrono.so;general;/usr/lib/x86_64-linux-gnu/libpthread.so;general;m;general;pcl_common;general;/usr/lib/x86_64-linux-gnu/libQtGui.so;general;/usr/lib/x86_64-linux-gnu/libQtCore.so;

//Value Computed by CMake
pcl_cc_tool_normal_estimation_BINARY_DIR:STATIC=/home/dell/pcl-1.7.2rc1.1/build/apps/cloud_composer

//Dependencies for the target
pcl_cc_tool_normal_estimation_LIB_DEPENDS:STATIC=general;/usr/lib/x86_64-linux-gnu/libboost_system.so;general;/usr/lib/x86_64-linux-gnu/libboost_filesystem.so;general;/usr/lib/x86_64-linux-gnu/libboost_thread.so;general;/usr/lib/x86_64-linux-gnu/libboost_date_time.so;general;/usr/lib/x86_64-linux-gnu/libboost_iostreams.so;general;/usr/lib/x86_64-linux-gnu/libboost_chrono.so;general;/usr/lib/x86_64-linux-gnu/libpthread.so;general;m;general;pcl_cc_tool_interface;general;pcl_common;general;pcl_io;general;pcl_features;general;pcl_kdtree;general;/usr/lib/x86_64-linux-gnu/libQtGui.so;general;/usr/lib/x86_64-linux-gnu/libQtCore.so;

//Value Computed by CMake
pcl_cc_tool_normal_estimation_SOURCE_DIR:STATIC=/home/dell/pcl-1.7.2rc1.1/apps/cloud_composer

//Value Computed by CMake
pcl_cc_tool_organized_segmentation_BINARY_DIR:STATIC=/home/dell/pcl-1.7.2rc1.1/build/apps/cloud_composer

//Dependencies for the target
pcl_cc_tool_organized_segmentation_LIB_DEPENDS:STATIC=general;/usr/lib/x86_64-linux-gnu/libboost_system.so;general;/usr/lib/x86_64-linux-gnu/libboost_filesystem.so;general;/usr/lib/x86_64-linux-gnu/libboost_thread.so;general;/usr/lib/x86_64-linux-gnu/libboost_date_time.so;general;/usr/lib/x86_64-linux-gnu/libboost_iostreams.so;general;/usr/lib/x86_64-linux-gnu/libboost_chrono.so;general;/usr/lib/x86_64-linux-gnu/libpthread.so;general;m;general;pcl_cc_tool_interface;general;pcl_common;general;pcl_io;general;pcl_segmentation;general;pcl_kdtree;general;/usr/lib/x86_64-linux-gnu/libQtGui.so;general;/usr/lib/x86_64-linux-gnu/libQtCore.so;

//Value Computed by CMake
pcl_cc_tool_organized_segmentation_SOURCE_DIR:STATIC=/home/dell/pcl-1.7.2rc1.1/apps/cloud_composer

//Value Computed by CMake
pcl_cc_tool_sanitize_cloud_BINARY_DIR:STATIC=/home/dell/pcl-1.7.2rc1.1/build/apps/cloud_composer

//Dependencies for the target
pcl_cc_tool_sanitize_cloud_LIB_DEPENDS:STATIC=general;/usr/lib/x86_64-linux-gnu/libboost_system.so;general;/usr/lib/x86_64-linux-gnu/libboost_filesystem.so;general;/usr/lib/x86_64-linux-gnu/libboost_thread.so;general;/usr/lib/x86_64-linux-gnu/libboost_date_time.so;general;/usr/lib/x86_64-linux-gnu/libboost_iostreams.so;general;/usr/lib/x86_64-linux-gnu/libboost_chrono.so;general;/usr/lib/x86_64-linux-gnu/libpthread.so;general;m;general;pcl_cc_tool_interface;general;pcl_common;general;pcl_io;general;pcl_filters;general;/usr/lib/x86_64-linux-gnu/libQtGui.so;general;/usr/lib/x86_64-linux-gnu/libQtCore.so;

//Value Computed by CMake
pcl_cc_tool_sanitize_cloud_SOURCE_DIR:STATIC=/home/dell/pcl-1.7.2rc1.1/apps/cloud_composer

//Value Computed by CMake
pcl_cc_tool_statistical_outlier_removal_BINARY_DIR:STATIC=/home/dell/pcl-1.7.2rc1.1/build/apps/cloud_composer

//Dependencies for the target
pcl_cc_tool_statistical_outlier_removal_LIB_DEPENDS:STATIC=general;/usr/lib/x86_64-linux-gnu/libboost_system.so;general;/usr/lib/x86_64-linux-gnu/libboost_filesystem.so;general;/usr/lib/x86_64-linux-gnu/libboost_thread.so;general;/usr/lib/x86_64-linux-gnu/libboost_date_time.so;general;/usr/lib/x86_64-linux-gnu/libboost_iostreams.so;general;/usr/lib/x86_64-linux-gnu/libboost_chrono.so;general;/usr/lib/x86_64-linux-gnu/libpthread.so;general;m;general;pcl_cc_tool_interface;general;pcl_common;general;pcl_io;general;pcl_filters;general;/usr/lib/x86_64-linux-gnu/libQtGui.so;general;/usr/lib/x86_64-linux-gnu/libQtCore.so;

//Value Computed by CMake
pcl_cc_tool_statistical_outlier_removal_SOURCE_DIR:STATIC=/home/dell/pcl-1.7.2rc1.1/apps/cloud_composer

//Value Computed by CMake
pcl_cc_tool_supervoxels_BINARY_DIR:STATIC=/home/dell/pcl-1.7.2rc1.1/build/apps/cloud_composer

//Dependencies for the target
pcl_cc_tool_supervoxels_LIB_DEPENDS:STATIC=general;/usr/lib/x86_64-linux-gnu/libboost_system.so;general;/usr/lib/x86_64-linux-gnu/libboost_filesystem.so;general;/usr/lib/x86_64-linux-gnu/libboost_thread.so;general;/usr/lib/x86_64-linux-gnu/libboost_date_time.so;general;/usr/lib/x86_64-linux-gnu/libboost_iostreams.so;general;/usr/lib/x86_64-linux-gnu/libboost_chrono.so;general;/usr/lib/x86_64-linux-gnu/libpthread.so;general;m;general;pcl_cc_tool_interface;general;pcl_common;general;pcl_io;general;pcl_octree;general;pcl_segmentation;general;/usr/lib/x86_64-linux-gnu/libQtGui.so;general;/usr/lib/x86_64-linux-gnu/libQtCore.so;

//Value Computed by CMake
pcl_cc_tool_supervoxels_SOURCE_DIR:STATIC=/home/dell/pcl-1.7.2rc1.1/apps/cloud_composer

//Value Computed by CMake
pcl_cc_tool_voxel_grid_downsample_BINARY_DIR:STATIC=/home/dell/pcl-1.7.2rc1.1/build/apps/cloud_composer

//Dependencies for the target
pcl_cc_tool_voxel_grid_downsample_LIB_DEPENDS:STATIC=general;/usr/lib/x86_64-linux-gnu/libboost_system.so;general;/usr/lib/x86_64-linux-gnu/libboost_filesystem.so;general;/usr/lib/x86_64-linux-gnu/libboost_thread.so;general;/usr/lib/x86_64-linux-gnu/libboost_date_time.so;general;/usr/lib/x86_64-linux-gnu/libboost_iostreams.so;general;/usr/lib/x86_64-linux-gnu/libboost_chrono.so;general;/usr/lib/x86_64-linux-gnu/libpthread.so;general;m;general;pcl_cc_tool_interface;general;pcl_common;general;pcl_io;general;pcl_filters;general;/usr/lib/x86_64-linux-gnu/libQtGui.so;general;/usr/lib/x86_64-linux-gnu/libQtCore.so;

//Value Computed by CMake
pcl_cc_tool_voxel_grid_downsample_SOURCE_DIR:STATIC=/home/dell/pcl-1.7.2rc1.1/apps/cloud_composer

//Dependencies for the target
pcl_common_LIB_DEPENDS:STATIC=general;/usr/lib/x86_64-linux-gnu/libboost_system.so;general;/usr/lib/x86_64-linux-gnu/libboost_filesystem.so;general;/usr/lib/x86_64-linux-gnu/libboost_thread.so;general;/usr/lib/x86_64-linux-gnu/libboost_date_time.so;general;/usr/lib/x86_64-linux-gnu/libboost_iostreams.so;general;/usr/lib/x86_64-linux-gnu/libboost_chrono.so;general;/usr/lib/x86_64-linux-gnu/libpthread.so;general;m;

//Dependencies for the target
pcl_features_LIB_DEPENDS:STATIC=general;/usr/lib/x86_64-linux-gnu/libboost_system.so;general;/usr/lib/x86_64-linux-gnu/libboost_filesystem.so;general;/usr/lib/x86_64-linux-gnu/libboost_thread.so;general;/usr/lib/x86_64-linux-gnu/libboost_date_time.so;general;/usr/lib/x86_64-linux-gnu/libboost_iostreams.so;general;/usr/lib/x86_64-linux-gnu/libboost_chrono.so;general;/usr/lib/x86_64-linux-gnu/libpthread.so;general;m;general;pcl_common;general;pcl_search;general;pcl_kdtree;general;pcl_octree;general;pcl_filters;

//Dependencies for the target
pcl_filters_LIB_DEPENDS:STATIC=general;/usr/lib/x86_64-linux-gnu/libboost_system.so;general;/usr/lib/x86_64-linux-gnu/libboost_filesystem.so;general;/usr/lib/x86_64-linux-gnu/libboost_thread.so;general;/usr/lib/x86_64-linux-gnu/libboost_date_time.so;general;/usr/lib/x86_64-linux-gnu/libboost_iostreams.so;general;/usr/lib/x86_64-linux-gnu/libboost_chrono.so;general;/usr/lib/x86_64-linux-gnu/libpthread.so;general;m;general;pcl_common;general;pcl_sample_consensus;general;pcl_search;general;pcl_kdtree;general;pcl_octree;

//Dependencies for target
pcl_gtest_LIB_DEPENDS:STATIC=

//Dependencies for the target
pcl_io_LIB_DEPENDS:STATIC=general;/usr/lib/x86_64-linux-gnu/libboost_system.so;general;/usr/lib/x86_64-linux-gnu/libboost_filesystem.so;general;/usr/lib/x86_64-linux-gnu/libboost_thread.so;general;/usr/lib/x86_64-linux-gnu/libboost_date_time.so;general;/usr/lib/x86_64-linux-gnu/libboost_iostreams.so;general;/usr/lib/x86_64-linux-gnu/libboost_chrono.so;general;/usr/lib/x86_64-linux-gnu/libpthread.so;general;m;general;pcl_common;general;pcl_io_ply;general;vtkCommon;general;vtkFiltering;general;vtkImaging;general;vtkGraphics;general;vtkGenericFiltering;general;vtkIO;general;vtkRendering;general;vtkVolumeRendering;general;vtkHybrid;general;vtkWidgets;general;vtkParallel;general;vtkInfovis;general;vtkGeovis;general;vtkViews;general;vtkCharts;general;/usr/lib/x86_64-linux-gnu/libpng.so;general;/usr/lib/x86_64-linux-gnu/libusb-1.0.so;general;/usr/lib/libOpenNI.so;

//Dependencies for the target
pcl_io_ply_LIB_DEPENDS:STATIC=general;/usr/lib/x86_64-linux-gnu/libboost_system.so;general;/usr/lib/x86_64-linux-gnu/libboost_filesystem.so;general;/usr/lib/x86_64-linux-gnu/libboost_thread.so;general;/usr/lib/x86_64-linux-gnu/libboost_date_time.so;general;/usr/lib/x86_64-linux-gnu/libboost_iostreams.so;general;/usr/lib/x86_64-linux-gnu/libboost_chrono.so;general;/usr/lib/x86_64-linux-gnu/libpthread.so;general;m;

//Dependencies for the target
pcl_kdtree_LIB_DEPENDS:STATIC=general;/usr/lib/x86_64-linux-gnu/libboost_system.so;general;/usr/lib/x86_64-linux-gnu/libboost_filesystem.so;general;/usr/lib/x86_64-linux-gnu/libboost_thread.so;general;/usr/lib/x86_64-linux-gnu/libboost_date_time.so;general;/usr/lib/x86_64-linux-gnu/libboost_iostreams.so;general;/usr/lib/x86_64-linux-gnu/libboost_chrono.so;general;/usr/lib/x86_64-linux-gnu/libpthread.so;general;m;general;pcl_common;optimized;/usr/lib/x86_64-linux-gnu/libflann_cpp.so;debug;/usr/lib/x86_64-linux-gnu/libflann_cpp.so;

//Dependencies for the target
pcl_keypoints_LIB_DEPENDS:STATIC=general;/usr/lib/x86_64-linux-gnu/libboost_system.so;general;/usr/lib/x86_64-linux-gnu/libboost_filesystem.so;general;/usr/lib/x86_64-linux-gnu/libboost_thread.so;general;/usr/lib/x86_64-linux-gnu/libboost_date_time.so;general;/usr/lib/x86_64-linux-gnu/libboost_iostreams.so;general;/usr/lib/x86_64-linux-gnu/libboost_chrono.so;general;/usr/lib/x86_64-linux-gnu/libpthread.so;general;m;general;pcl_features;general;pcl_filters;

//Dependencies for the target
pcl_octree_LIB_DEPENDS:STATIC=general;/usr/lib/x86_64-linux-gnu/libboost_system.so;general;/usr/lib/x86_64-linux-gnu/libboost_filesystem.so;general;/usr/lib/x86_64-linux-gnu/libboost_thread.so;general;/usr/lib/x86_64-linux-gnu/libboost_date_time.so;general;/usr/lib/x86_64-linux-gnu/libboost_iostreams.so;general;/usr/lib/x86_64-linux-gnu/libboost_chrono.so;general;/usr/lib/x86_64-linux-gnu/libpthread.so;general;m;

//Dependencies for the target
pcl_outofcore_LIB_DEPENDS:STATIC=general;/usr/lib/x86_64-linux-gnu/libboost_system.so;general;/usr/lib/x86_64-linux-gnu/libboost_filesystem.so;general;/usr/lib/x86_64-linux-gnu/libboost_thread.so;general;/usr/lib/x86_64-linux-gnu/libboost_date_time.so;general;/usr/lib/x86_64-linux-gnu/libboost_iostreams.so;general;/usr/lib/x86_64-linux-gnu/libboost_chrono.so;general;/usr/lib/x86_64-linux-gnu/libpthread.so;general;m;general;pcl_common;general;pcl_visualization;general;/usr/lib/x86_64-linux-gnu/libboost_system.so;

//Dependencies for the target
pcl_people_LIB_DEPENDS:STATIC=general;/usr/lib/x86_64-linux-gnu/libboost_system.so;general;/usr/lib/x86_64-linux-gnu/libboost_filesystem.so;general;/usr/lib/x86_64-linux-gnu/libboost_thread.so;general;/usr/lib/x86_64-linux-gnu/libboost_date_time.so;general;/usr/lib/x86_64-linux-gnu/libboost_iostreams.so;general;/usr/lib/x86_64-linux-gnu/libboost_chrono.so;general;/usr/lib/x86_64-linux-gnu/libpthread.so;general;m;

//Dependencies for the target
pcl_recognition_LIB_DEPENDS:STATIC=general;/usr/lib/x86_64-linux-gnu/libboost_system.so;general;/usr/lib/x86_64-linux-gnu/libboost_filesystem.so;general;/usr/lib/x86_64-linux-gnu/libboost_thread.so;general;/usr/lib/x86_64-linux-gnu/libboost_date_time.so;general;/usr/lib/x86_64-linux-gnu/libboost_iostreams.so;general;/usr/lib/x86_64-linux-gnu/libboost_chrono.so;general;/usr/lib/x86_64-linux-gnu/libpthread.so;general;m;general;pcl_common;general;pcl_kdtree;general;pcl_octree;general;pcl_search;general;pcl_features;general;pcl_registration;general;pcl_sample_consensus;general;pcl_filters;general;pcl_io;

//Dependencies for the target
pcl_registration_LIB_DEPENDS:STATIC=general;/usr/lib/x86_64-linux-gnu/libboost_system.so;general;/usr/lib/x86_64-linux-gnu/libboost_filesystem.so;general;/usr/lib/x86_64-linux-gnu/libboost_thread.so;general;/usr/lib/x86_64-linux-gnu/libboost_date_time.so;general;/usr/lib/x86_64-linux-gnu/libboost_iostreams.so;general;/usr/lib/x86_64-linux-gnu/libboost_chrono.so;general;/usr/lib/x86_64-linux-gnu/libpthread.so;general;m;general;pcl_kdtree;general;pcl_search;general;pcl_sample_consensus;general;pcl_features;general;pcl_filters;

//Dependencies for the target
pcl_sample_consensus_LIB_DEPENDS:STATIC=general;/usr/lib/x86_64-linux-gnu/libboost_system.so;general;/usr/lib/x86_64-linux-gnu/libboost_filesystem.so;general;/usr/lib/x86_64-linux-gnu/libboost_thread.so;general;/usr/lib/x86_64-linux-gnu/libboost_date_time.so;general;/usr/lib/x86_64-linux-gnu/libboost_iostreams.so;general;/usr/lib/x86_64-linux-gnu/libboost_chrono.so;general;/usr/lib/x86_64-linux-gnu/libpthread.so;general;m;general;pcl_common;

//Dependencies for the target
pcl_search_LIB_DEPENDS:STATIC=general;/usr/lib/x86_64-linux-gnu/libboost_system.so;general;/usr/lib/x86_64-linux-gnu/libboost_filesystem.so;general;/usr/lib/x86_64-linux-gnu/libboost_thread.so;general;/usr/lib/x86_64-linux-gnu/libboost_date_time.so;general;/usr/lib/x86_64-linux-gnu/libboost_iostreams.so;general;/usr/lib/x86_64-linux-gnu/libboost_chrono.so;general;/usr/lib/x86_64-linux-gnu/libpthread.so;general;m;general;pcl_common;optimized;/usr/lib/x86_64-linux-gnu/libflann_cpp.so;debug;/usr/lib/x86_64-linux-gnu/libflann_cpp.so;general;pcl_octree;general;pcl_kdtree;

//Dependencies for the target
pcl_segmentation_LIB_DEPENDS:STATIC=general;/usr/lib/x86_64-linux-gnu/libboost_system.so;general;/usr/lib/x86_64-linux-gnu/libboost_filesystem.so;general;/usr/lib/x86_64-linux-gnu/libboost_thread.so;general;/usr/lib/x86_64-linux-gnu/libboost_date_time.so;general;/usr/lib/x86_64-linux-gnu/libboost_iostreams.so;general;/usr/lib/x86_64-linux-gnu/libboost_chrono.so;general;/usr/lib/x86_64-linux-gnu/libpthread.so;general;m;general;pcl_search;general;pcl_sample_consensus;general;pcl_filters;general;pcl_features;

//Dependencies for the target
pcl_surface_LIB_DEPENDS:STATIC=general;/usr/lib/x86_64-linux-gnu/libboost_system.so;general;/usr/lib/x86_64-linux-gnu/libboost_filesystem.so;general;/usr/lib/x86_64-linux-gnu/libboost_thread.so;general;/usr/lib/x86_64-linux-gnu/libboost_date_time.so;general;/usr/lib/x86_64-linux-gnu/libboost_iostreams.so;general;/usr/lib/x86_64-linux-gnu/libboost_chrono.so;general;/usr/lib/x86_64-linux-gnu/libpthread.so;general;m;general;pcl_common;general;pcl_search;general;pcl_kdtree;general;pcl_octree;general;vtkCommon;general;vtkFiltering;general;vtkImaging;general;vtkGraphics;general;vtkGenericFiltering;general;vtkIO;general;vtkRendering;general;vtkVolumeRendering;general;vtkHybrid;general;vtkWidgets;general;vtkParallel;general;vtkInfovis;general;vtkGeovis;general;vtkViews;general;vtkCharts;optimized;/usr/lib/x86_64-linux-gnu/libqhull.so;debug;/usr/lib/x86_64-linux-gnu/libqhull.so;

//Dependencies for the target
pcl_tracking_LIB_DEPENDS:STATIC=general;/usr/lib/x86_64-linux-gnu/libboost_system.so;general;/usr/lib/x86_64-linux-gnu/libboost_filesystem.so;general;/usr/lib/x86_64-linux-gnu/libboost_thread.so;general;/usr/lib/x86_64-linux-gnu/libboost_date_time.so;general;/usr/lib/x86_64-linux-gnu/libboost_iostreams.so;general;/usr/lib/x86_64-linux-gnu/libboost_chrono.so;general;/usr/lib/x86_64-linux-gnu/libpthread.so;general;m;general;pcl_common;general;pcl_kdtree;general;pcl_search;general;pcl_filters;general;pcl_octree;

//Dependencies for the target
pcl_visualization_LIB_DEPENDS:STATIC=general;/usr/lib/x86_64-linux-gnu/libboost_system.so;general;/usr/lib/x86_64-linux-gnu/libboost_filesystem.so;general;/usr/lib/x86_64-linux-gnu/libboost_thread.so;general;/usr/lib/x86_64-linux-gnu/libboost_date_time.so;general;/usr/lib/x86_64-linux-gnu/libboost_iostreams.so;general;/usr/lib/x86_64-linux-gnu/libboost_chrono.so;general;/usr/lib/x86_64-linux-gnu/libpthread.so;general;m;general;pcl_common;general;pcl_io;general;pcl_kdtree;general;vtkCommon;general;vtkFiltering;general;vtkImaging;general;vtkGraphics;general;vtkGenericFiltering;general;vtkIO;general;vtkRendering;general;vtkVolumeRendering;general;vtkHybrid;general;vtkWidgets;general;vtkParallel;general;vtkInfovis;general;vtkGeovis;general;vtkViews;general;vtkCharts;general;/usr/lib/x86_64-linux-gnu/libGLU.so;general;/usr/lib/x86_64-linux-gnu/libGL.so;general;/usr/lib/x86_64-linux-gnu/libSM.so;general;/usr/lib/x86_64-linux-gnu/libICE.so;general;/usr/lib/x86_64-linux-gnu/libX11.so;general;/usr/lib/x86_64-linux-gnu/libXext.so;

//The directory containing a CMake configuration file for tide.
tide_DIR:PATH=tide_DIR-NOTFOUND


########################
# INTERNAL cache entries
########################

:INTERNAL=
//ADVANCED property for variable: BUILD_OPENNI
BUILD_OPENNI-ADVANCED:INTERNAL=1
//ADVANCED property for variable: BUILD_OPENNI2
BUILD_OPENNI2-ADVANCED:INTERNAL=1
//MODIFIED property for variable: BUILD_apps
BUILD_apps-MODIFIED:INTERNAL=ON
//MODIFIED property for variable: BUILD_apps_cloud_composer
BUILD_apps_cloud_composer-MODIFIED:INTERNAL=ON
//MODIFIED property for variable: BUILD_apps_in_hand_scanner
BUILD_apps_in_hand_scanner-MODIFIED:INTERNAL=ON
//MODIFIED property for variable: BUILD_apps_modeler
BUILD_apps_modeler-MODIFIED:INTERNAL=ON
//MODIFIED property for variable: BUILD_apps_optronic_viewer
BUILD_apps_optronic_viewer-MODIFIED:INTERNAL=ON
//MODIFIED property for variable: BUILD_apps_point_cloud_editor
BUILD_apps_point_cloud_editor-MODIFIED:INTERNAL=ON
//MODIFIED property for variable: BUILD_examples
BUILD_examples-MODIFIED:INTERNAL=ON
//MODIFIED property for variable: BUILD_global_tests
BUILD_global_tests-MODIFIED:INTERNAL=ON
//MODIFIED property for variable: BUILD_surface_on_nurbs
BUILD_surface_on_nurbs-MODIFIED:INTERNAL=ON
//ADVANCED property for variable: Boost_CHRONO_LIBRARY_DEBUG
Boost_CHRONO_LIBRARY_DEBUG-ADVANCED:INTERNAL=1
//ADVANCED property for variable: Boost_CHRONO_LIBRARY_RELEASE
Boost_CHRONO_LIBRARY_RELEASE-ADVANCED:INTERNAL=1
//ADVANCED property for variable: Boost_DATE_TIME_LIBRARY_DEBUG
Boost_DATE_TIME_LIBRARY_DEBUG-ADVANCED:INTERNAL=1
//ADVANCED property for variable: Boost_DATE_TIME_LIBRARY_RELEASE
Boost_DATE_TIME_LIBRARY_RELEASE-ADVANCED:INTERNAL=1
//ADVANCED property for variable: Boost_FILESYSTEM_LIBRARY_DEBUG
Boost_FILESYSTEM_LIBRARY_DEBUG-ADVANCED:INTERNAL=1
//ADVANCED property for variable: Boost_FILESYSTEM_LIBRARY_RELEASE
Boost_FILESYSTEM_LIBRARY_RELEASE-ADVANCED:INTERNAL=1
//ADVANCED property for variable: Boost_INCLUDE_DIR
Boost_INCLUDE_DIR-ADVANCED:INTERNAL=1
//ADVANCED property for variable: Boost_IOSTREAMS_LIBRARY_DEBUG
Boost_IOSTREAMS_LIBRARY_DEBUG-ADVANCED:INTERNAL=1
//ADVANCED property for variable: Boost_IOSTREAMS_LIBRARY_RELEASE
Boost_IOSTREAMS_LIBRARY_RELEASE-ADVANCED:INTERNAL=1
//ADVANCED property for variable: Boost_LIBRARY_DIR
Boost_LIBRARY_DIR-ADVANCED:INTERNAL=1
//ADVANCED property for variable: Boost_MPI_LIBRARY_DEBUG
Boost_MPI_LIBRARY_DEBUG-ADVANCED:INTERNAL=1
//ADVANCED property for variable: Boost_MPI_LIBRARY_RELEASE
Boost_MPI_LIBRARY_RELEASE-ADVANCED:INTERNAL=1
//ADVANCED property for variable: Boost_SERIALIZATION_LIBRARY_DEBUG
Boost_SERIALIZATION_LIBRARY_DEBUG-ADVANCED:INTERNAL=1
//ADVANCED property for variable: Boost_SERIALIZATION_LIBRARY_RELEASE
Boost_SERIALIZATION_LIBRARY_RELEASE-ADVANCED:INTERNAL=1
//ADVANCED property for variable: Boost_SYSTEM_LIBRARY_DEBUG
Boost_SYSTEM_LIBRARY_DEBUG-ADVANCED:INTERNAL=1
//ADVANCED property for variable: Boost_SYSTEM_LIBRARY_RELEASE
Boost_SYSTEM_LIBRARY_RELEASE-ADVANCED:INTERNAL=1
//ADVANCED property for variable: Boost_THREAD_LIBRARY_DEBUG
Boost_THREAD_LIBRARY_DEBUG-ADVANCED:INTERNAL=1
//ADVANCED property for variable: Boost_THREAD_LIBRARY_RELEASE
Boost_THREAD_LIBRARY_RELEASE-ADVANCED:INTERNAL=1
//ADVANCED property for variable: CMAKE_AR
CMAKE_AR-ADVANCED:INTERNAL=1
//ADVANCED property for variable: CMAKE_BUILD_TOOL
CMAKE_BUILD_TOOL-ADVANCED:INTERNAL=1
//What is the target build tool cmake is generating for.
CMAKE_BUILD_TOOL:INTERNAL=/usr/bin/make
//MODIFIED property for variable: CMAKE_BUILD_TYPE
CMAKE_BUILD_TYPE-MODIFIED:INTERNAL=ON
//This is the directory where this CMakeCache.txt was created
CMAKE_CACHEFILE_DIR:INTERNAL=/home/dell/pcl-1.7.2rc1.1/build
//Major version of cmake used to create the current loaded cache
CMAKE_CACHE_MAJOR_VERSION:INTERNAL=2
//Minor version of cmake used to create the current loaded cache
CMAKE_CACHE_MINOR_VERSION:INTERNAL=8
//Patch version of cmake used to create the current loaded cache
CMAKE_CACHE_PATCH_VERSION:INTERNAL=12
//ADVANCED property for variable: CMAKE_COLOR_MAKEFILE
CMAKE_COLOR_MAKEFILE-ADVANCED:INTERNAL=1
//Path to CMake executable.
CMAKE_COMMAND:INTERNAL=/usr/bin/cmake
//Path to cpack program executable.
CMAKE_CPACK_COMMAND:INTERNAL=/usr/bin/cpack
//Path to ctest program executable.
CMAKE_CTEST_COMMAND:INTERNAL=/usr/bin/ctest
//ADVANCED property for variable: CMAKE_CXX_COMPILER
CMAKE_CXX_COMPILER-ADVANCED:INTERNAL=1
//ADVANCED property for variable: CMAKE_CXX_FLAGS
CMAKE_CXX_FLAGS-ADVANCED:INTERNAL=1
//ADVANCED property for variable: CMAKE_CXX_FLAGS_DEBUG
CMAKE_CXX_FLAGS_DEBUG-ADVANCED:INTERNAL=1
//ADVANCED property for variable: CMAKE_CXX_FLAGS_MAINTAINER
CMAKE_CXX_FLAGS_MAINTAINER-ADVANCED:INTERNAL=1
//ADVANCED property for variable: CMAKE_CXX_FLAGS_MINSIZEREL
CMAKE_CXX_FLAGS_MINSIZEREL-ADVANCED:INTERNAL=1
//ADVANCED property for variable: CMAKE_CXX_FLAGS_RELEASE
CMAKE_CXX_FLAGS_RELEASE-ADVANCED:INTERNAL=1
//ADVANCED property for variable: CMAKE_CXX_FLAGS_RELWITHDEBINFO
CMAKE_CXX_FLAGS_RELWITHDEBINFO-ADVANCED:INTERNAL=1
//ADVANCED property for variable: CMAKE_C_COMPILER
CMAKE_C_COMPILER-ADVANCED:INTERNAL=1
//ADVANCED property for variable: CMAKE_C_FLAGS
CMAKE_C_FLAGS-ADVANCED:INTERNAL=1
//ADVANCED property for variable: CMAKE_C_FLAGS_DEBUG
CMAKE_C_FLAGS_DEBUG-ADVANCED:INTERNAL=1
//ADVANCED property for variable: CMAKE_C_FLAGS_MAINTAINER
CMAKE_C_FLAGS_MAINTAINER-ADVANCED:INTERNAL=1
//ADVANCED property for variable: CMAKE_C_FLAGS_MINSIZEREL
CMAKE_C_FLAGS_MINSIZEREL-ADVANCED:INTERNAL=1
//ADVANCED property for variable: CMAKE_C_FLAGS_RELEASE
CMAKE_C_FLAGS_RELEASE-ADVANCED:INTERNAL=1
//ADVANCED property for variable: CMAKE_C_FLAGS_RELWITHDEBINFO
CMAKE_C_FLAGS_RELWITHDEBINFO-ADVANCED:INTERNAL=1
//Path to cache edit program executable.
CMAKE_EDIT_COMMAND:INTERNAL=/usr/bin/ccmake
//Executable file format
CMAKE_EXECUTABLE_FORMAT:INTERNAL=ELF
//ADVANCED property for variable: CMAKE_EXE_LINKER_FLAGS
CMAKE_EXE_LINKER_FLAGS-ADVANCED:INTERNAL=1
//ADVANCED property for variable: CMAKE_EXE_LINKER_FLAGS_DEBUG
CMAKE_EXE_LINKER_FLAGS_DEBUG-ADVANCED:INTERNAL=1
//ADVANCED property for variable: CMAKE_EXE_LINKER_FLAGS_MAINTAINER
CMAKE_EXE_LINKER_FLAGS_MAINTAINER-ADVANCED:INTERNAL=1
//ADVANCED property for variable: CMAKE_EXE_LINKER_FLAGS_MINSIZEREL
CMAKE_EXE_LINKER_FLAGS_MINSIZEREL-ADVANCED:INTERNAL=1
//ADVANCED property for variable: CMAKE_EXE_LINKER_FLAGS_RELEASE
CMAKE_EXE_LINKER_FLAGS_RELEASE-ADVANCED:INTERNAL=1
//ADVANCED property for variable: CMAKE_EXE_LINKER_FLAGS_RELWITHDEBINFO
CMAKE_EXE_LINKER_FLAGS_RELWITHDEBINFO-ADVANCED:INTERNAL=1
//ADVANCED property for variable: CMAKE_EXPORT_COMPILE_COMMANDS
CMAKE_EXPORT_COMPILE_COMMANDS-ADVANCED:INTERNAL=1
//Name of generator.
CMAKE_GENERATOR:INTERNAL=Unix Makefiles
//Name of generator toolset.
CMAKE_GENERATOR_TOOLSET:INTERNAL=
//Have function connect
CMAKE_HAVE_CONNECT:INTERNAL=1
//Have function gethostbyname
CMAKE_HAVE_GETHOSTBYNAME:INTERNAL=1
//Have function remove
CMAKE_HAVE_REMOVE:INTERNAL=1
//Have function shmat
CMAKE_HAVE_SHMAT:INTERNAL=1
//Start directory with the top level CMakeLists.txt file for this
// project
CMAKE_HOME_DIRECTORY:INTERNAL=/home/dell/pcl-1.7.2rc1.1
//Install .so files without execute permission.
CMAKE_INSTALL_SO_NO_EXE:INTERNAL=1
//Have library ICE
CMAKE_LIB_ICE_HAS_ICECONNECTIONNUMBER:INTERNAL=1
//ADVANCED property for variable: CMAKE_LINKER
CMAKE_LINKER-ADVANCED:INTERNAL=1
//ADVANCED property for variable: CMAKE_MAKE_PROGRAM
CMAKE_MAKE_PROGRAM-ADVANCED:INTERNAL=1
//ADVANCED property for variable: CMAKE_MODULE_LINKER_FLAGS
CMAKE_MODULE_LINKER_FLAGS-ADVANCED:INTERNAL=1
//ADVANCED property for variable: CMAKE_MODULE_LINKER_FLAGS_DEBUG
CMAKE_MODULE_LINKER_FLAGS_DEBUG-ADVANCED:INTERNAL=1
//ADVANCED property for variable: CMAKE_MODULE_LINKER_FLAGS_MINSIZEREL
CMAKE_MODULE_LINKER_FLAGS_MINSIZEREL-ADVANCED:INTERNAL=1
//ADVANCED property for variable: CMAKE_MODULE_LINKER_FLAGS_RELEASE
CMAKE_MODULE_LINKER_FLAGS_RELEASE-ADVANCED:INTERNAL=1
//ADVANCED property for variable: CMAKE_MODULE_LINKER_FLAGS_RELWITHDEBINFO
CMAKE_MODULE_LINKER_FLAGS_RELWITHDEBINFO-ADVANCED:INTERNAL=1
//ADVANCED property for variable: CMAKE_MSVC_CODE_LINK_OPTIMIZATION
CMAKE_MSVC_CODE_LINK_OPTIMIZATION-ADVANCED:INTERNAL=1
//ADVANCED property for variable: CMAKE_NM
CMAKE_NM-ADVANCED:INTERNAL=1
//number of local generators
CMAKE_NUMBER_OF_LOCAL_GENERATORS:INTERNAL=57
//ADVANCED property for variable: CMAKE_OBJCOPY
CMAKE_OBJCOPY-ADVANCED:INTERNAL=1
//ADVANCED property for variable: CMAKE_OBJDUMP
CMAKE_OBJDUMP-ADVANCED:INTERNAL=1
//ADVANCED property for variable: CMAKE_RANLIB
CMAKE_RANLIB-ADVANCED:INTERNAL=1
//Path to CMake installation.
CMAKE_ROOT:INTERNAL=/usr/share/cmake-2.8
//ADVANCED property for variable: CMAKE_SHARED_LINKER_FLAGS
CMAKE_SHARED_LINKER_FLAGS-ADVANCED:INTERNAL=1
//ADVANCED property for variable: CMAKE_SHARED_LINKER_FLAGS_DEBUG
CMAKE_SHARED_LINKER_FLAGS_DEBUG-ADVANCED:INTERNAL=1
//ADVANCED property for variable: CMAKE_SHARED_LINKER_FLAGS_MAINTAINER
CMAKE_SHARED_LINKER_FLAGS_MAINTAINER-ADVANCED:INTERNAL=1
//ADVANCED property for variable: CMAKE_SHARED_LINKER_FLAGS_MINSIZEREL
CMAKE_SHARED_LINKER_FLAGS_MINSIZEREL-ADVANCED:INTERNAL=1
//ADVANCED property for variable: CMAKE_SHARED_LINKER_FLAGS_RELEASE
CMAKE_SHARED_LINKER_FLAGS_RELEASE-ADVANCED:INTERNAL=1
//ADVANCED property for variable: CMAKE_SHARED_LINKER_FLAGS_RELWITHDEBINFO
CMAKE_SHARED_LINKER_FLAGS_RELWITHDEBINFO-ADVANCED:INTERNAL=1
//ADVANCED property for variable: CMAKE_SKIP_INSTALL_RPATH
CMAKE_SKIP_INSTALL_RPATH-ADVANCED:INTERNAL=1
//ADVANCED property for variable: CMAKE_SKIP_RPATH
CMAKE_SKIP_RPATH-ADVANCED:INTERNAL=1
//ADVANCED property for variable: CMAKE_STATIC_LINKER_FLAGS
CMAKE_STATIC_LINKER_FLAGS-ADVANCED:INTERNAL=1
//ADVANCED property for variable: CMAKE_STATIC_LINKER_FLAGS_DEBUG
CMAKE_STATIC_LINKER_FLAGS_DEBUG-ADVANCED:INTERNAL=1
//ADVANCED property for variable: CMAKE_STATIC_LINKER_FLAGS_MINSIZEREL
CMAKE_STATIC_LINKER_FLAGS_MINSIZEREL-ADVANCED:INTERNAL=1
//ADVANCED property for variable: CMAKE_STATIC_LINKER_FLAGS_RELEASE
CMAKE_STATIC_LINKER_FLAGS_RELEASE-ADVANCED:INTERNAL=1
//ADVANCED property for variable: CMAKE_STATIC_LINKER_FLAGS_RELWITHDEBINFO
CMAKE_STATIC_LINKER_FLAGS_RELWITHDEBINFO-ADVANCED:INTERNAL=1
//ADVANCED property for variable: CMAKE_STRIP
CMAKE_STRIP-ADVANCED:INTERNAL=1
//ADVANCED property for variable: CMAKE_TIMING_VERBOSE
CMAKE_TIMING_VERBOSE-ADVANCED:INTERNAL=1
//uname command
CMAKE_UNAME:INTERNAL=/bin/uname
//ADVANCED property for variable: CMAKE_USE_RELATIVE_PATHS
CMAKE_USE_RELATIVE_PATHS-ADVANCED:INTERNAL=1
//ADVANCED property for variable: CMAKE_VERBOSE_MAKEFILE
CMAKE_VERBOSE_MAKEFILE-ADVANCED:INTERNAL=1
//ADVANCED property for variable: CPACK_SOURCE_TBZ2
CPACK_SOURCE_TBZ2-ADVANCED:INTERNAL=1
//ADVANCED property for variable: CPACK_SOURCE_TGZ
CPACK_SOURCE_TGZ-ADVANCED:INTERNAL=1
//ADVANCED property for variable: CPACK_SOURCE_TZ
CPACK_SOURCE_TZ-ADVANCED:INTERNAL=1
//ADVANCED property for variable: CPACK_SOURCE_ZIP
CPACK_SOURCE_ZIP-ADVANCED:INTERNAL=1
//ADVANCED property for variable: DOXYGEN_DOT_EXECUTABLE
DOXYGEN_DOT_EXECUTABLE-ADVANCED:INTERNAL=1
//ADVANCED property for variable: DOXYGEN_DOT_PATH
DOXYGEN_DOT_PATH-ADVANCED:INTERNAL=1
//ADVANCED property for variable: DOXYGEN_EXECUTABLE
DOXYGEN_EXECUTABLE-ADVANCED:INTERNAL=1
//ADVANCED property for variable: EIGEN_INCLUDE_DIR
EIGEN_INCLUDE_DIR-ADVANCED:INTERNAL=1
//Details about finding Doxygen
FIND_PACKAGE_MESSAGE_DETAILS_Doxygen:INTERNAL=[/usr/bin/doxygen][v1.8.6()]
//Details about finding Eigen
FIND_PACKAGE_MESSAGE_DETAILS_Eigen:INTERNAL=[/usr/include/eigen3][v()]
//Details about finding FLANN
FIND_PACKAGE_MESSAGE_DETAILS_FLANN:INTERNAL=[/usr/lib/x86_64-linux-gnu/libflann_cpp.so][/usr/include][v(1.7.0)]
//Details about finding Gtest
FIND_PACKAGE_MESSAGE_DETAILS_Gtest:INTERNAL=[/usr/include][/usr/src/gtest][v()]
//Details about finding LIBUSB_1
FIND_PACKAGE_MESSAGE_DETAILS_LIBUSB_1:INTERNAL=[/usr/lib/x86_64-linux-gnu/libusb-1.0.so][/usr/include][v()]
//Details about finding OpenMP
FIND_PACKAGE_MESSAGE_DETAILS_OpenMP:INTERNAL=[-fopenmp][-fopenmp][v()]
//Details about finding OpenNI
FIND_PACKAGE_MESSAGE_DETAILS_OpenNI:INTERNAL=[/usr/lib/libOpenNI.so][/usr/include/ni][v()]
//Details about finding OpenNI2
FIND_PACKAGE_MESSAGE_DETAILS_OpenNI2:INTERNAL=[/usr/lib/libOpenNI2.so][/usr/include/openni2][v()]
//Details about finding PNG
FIND_PACKAGE_MESSAGE_DETAILS_PNG:INTERNAL=[/usr/lib/x86_64-linux-gnu/libpng.so][/usr/include][v1.2.50()]
//Details about finding PkgConfig
FIND_PACKAGE_MESSAGE_DETAILS_PkgConfig:INTERNAL=[/usr/bin/pkg-config][v0.26()]
//Details about finding PythonInterp
FIND_PACKAGE_MESSAGE_DETAILS_PythonInterp:INTERNAL=[/usr/bin/python][v2.7.6()]
//Details about finding QVTK
FIND_PACKAGE_MESSAGE_DETAILS_QVTK:INTERNAL=[/usr/lib/libQVTK.so][/usr/include][v()]
//Details about finding Qhull
FIND_PACKAGE_MESSAGE_DETAILS_Qhull:INTERNAL=[/usr/lib/x86_64-linux-gnu/libqhull.so][/usr/include][v()]
//Details about finding Qt4
FIND_PACKAGE_MESSAGE_DETAILS_Qt4:INTERNAL=[/usr/bin/qmake-qt4][/usr/lib/x86_64-linux-gnu/qt4/bin/moc][/usr/lib/x86_64-linux-gnu/qt4/bin/rcc][/usr/lib/x86_64-linux-gnu/qt4/bin/uic][/usr/include/qt4][/usr/lib/x86_64-linux-gnu][/usr/lib/x86_64-linux-gnu/libQtCore.so][v4.8.6()]
//Details about finding Sphinx
FIND_PACKAGE_MESSAGE_DETAILS_Sphinx:INTERNAL=[/usr/local/bin/sphinx-build][v()]
//Details about finding USB_10
FIND_PACKAGE_MESSAGE_DETAILS_USB_10:INTERNAL=[/usr/lib/x86_64-linux-gnu/libusb-1.0.so][/usr/include][v()]
//Details about finding X11
FIND_PACKAGE_MESSAGE_DETAILS_X11:INTERNAL=[/usr/lib/x86_64-linux-gnu/libX11.so][/usr/include]
//Details about finding ZLIB
FIND_PACKAGE_MESSAGE_DETAILS_ZLIB:INTERNAL=[/usr/lib/x86_64-linux-gnu/libz.so][/usr/include][v1.2.8()]
//ADVANCED property for variable: FLANN_INCLUDE_DIR
FLANN_INCLUDE_DIR-ADVANCED:INTERNAL=1
//ADVANCED property for variable: FLANN_LIBRARY
FLANN_LIBRARY-ADVANCED:INTERNAL=1
//ADVANCED property for variable: FLANN_LIBRARY_DEBUG
FLANN_LIBRARY_DEBUG-ADVANCED:INTERNAL=1
//ADVANCED property for variable: GLUT_INCLUDE_DIR
GLUT_INCLUDE_DIR-ADVANCED:INTERNAL=1
//ADVANCED property for variable: GLUT_Xi_LIBRARY
GLUT_Xi_LIBRARY-ADVANCED:INTERNAL=1
//ADVANCED property for variable: GLUT_Xmu_LIBRARY
GLUT_Xmu_LIBRARY-ADVANCED:INTERNAL=1
//ADVANCED property for variable: GLUT_glut_LIBRARY
GLUT_glut_LIBRARY-ADVANCED:INTERNAL=1
//ADVANCED property for variable: GTEST_INCLUDE_DIR
GTEST_INCLUDE_DIR-ADVANCED:INTERNAL=1
//ADVANCED property for variable: GTEST_SRC_DIR
GTEST_SRC_DIR-ADVANCED:INTERNAL=1
//Test HAVE_MM_MALLOC
HAVE_MM_MALLOC:INTERNAL=1
//Result of TRY_COMPILE
HAVE_MM_MALLOC_COMPILED:INTERNAL=TRUE
//Result of TRY_RUN
HAVE_MM_MALLOC_EXITCODE:INTERNAL=0
//Test HAVE_POSIX_MEMALIGN
HAVE_POSIX_MEMALIGN:INTERNAL=1
//Result of TRY_COMPILE
HAVE_POSIX_MEMALIGN_COMPILED:INTERNAL=TRUE
//Result of TRY_RUN
HAVE_POSIX_MEMALIGN_EXITCODE:INTERNAL=0
//Test HAVE_SSE2_EXTENSIONS
HAVE_SSE2_EXTENSIONS:INTERNAL=1
//Result of TRY_COMPILE
HAVE_SSE2_EXTENSIONS_COMPILED:INTERNAL=TRUE
//Result of TRY_RUN
HAVE_SSE2_EXTENSIONS_EXITCODE:INTERNAL=0
//Test HAVE_SSE3_EXTENSIONS
HAVE_SSE3_EXTENSIONS:INTERNAL=1
//Result of TRY_COMPILE
HAVE_SSE3_EXTENSIONS_COMPILED:INTERNAL=TRUE
//Result of TRY_RUN
HAVE_SSE3_EXTENSIONS_EXITCODE:INTERNAL=0
//Test HAVE_SSE4_1_EXTENSIONS
HAVE_SSE4_1_EXTENSIONS:INTERNAL=1
//Result of TRY_COMPILE
HAVE_SSE4_1_EXTENSIONS_COMPILED:INTERNAL=TRUE
//Result of TRY_RUN
HAVE_SSE4_1_EXTENSIONS_EXITCODE:INTERNAL=0
//Test HAVE_SSE4_2_EXTENSIONS
HAVE_SSE4_2_EXTENSIONS:INTERNAL=1
//Result of TRY_COMPILE
HAVE_SSE4_2_EXTENSIONS_COMPILED:INTERNAL=TRUE
//Result of TRY_RUN
HAVE_SSE4_2_EXTENSIONS_EXITCODE:INTERNAL=0
//Test HAVE_SSE_EXTENSIONS
HAVE_SSE_EXTENSIONS:INTERNAL=1
//Result of TRY_COMPILE
HAVE_SSE_EXTENSIONS_COMPILED:INTERNAL=TRUE
//Result of TRY_RUN
HAVE_SSE_EXTENSIONS_EXITCODE:INTERNAL=0
METSLIB_CFLAGS:INTERNAL=
METSLIB_CFLAGS_I:INTERNAL=
METSLIB_CFLAGS_OTHER:INTERNAL=
METSLIB_FOUND:INTERNAL=
METSLIB_INCLUDEDIR:INTERNAL=
METSLIB_LIBDIR:INTERNAL=
METSLIB_LIBS:INTERNAL=
METSLIB_LIBS_L:INTERNAL=
METSLIB_LIBS_OTHER:INTERNAL=
METSLIB_LIBS_PATHS:INTERNAL=
METSLIB_PREFIX:INTERNAL=
METSLIB_STATIC_CFLAGS:INTERNAL=
METSLIB_STATIC_CFLAGS_I:INTERNAL=
METSLIB_STATIC_CFLAGS_OTHER:INTERNAL=
METSLIB_STATIC_LIBDIR:INTERNAL=
METSLIB_STATIC_LIBS:INTERNAL=
METSLIB_STATIC_LIBS_L:INTERNAL=
METSLIB_STATIC_LIBS_OTHER:INTERNAL=
METSLIB_STATIC_LIBS_PATHS:INTERNAL=
METSLIB_VERSION:INTERNAL=
METSLIB_metslib_INCLUDEDIR:INTERNAL=
METSLIB_metslib_LIBDIR:INTERNAL=
METSLIB_metslib_PREFIX:INTERNAL=
METSLIB_metslib_VERSION:INTERNAL=
//ADVANCED property for variable: OPENGL_INCLUDE_DIR
OPENGL_INCLUDE_DIR-ADVANCED:INTERNAL=1
//ADVANCED property for variable: OPENGL_gl_LIBRARY
OPENGL_gl_LIBRARY-ADVANCED:INTERNAL=1
//ADVANCED property for variable: OPENGL_glu_LIBRARY
OPENGL_glu_LIBRARY-ADVANCED:INTERNAL=1
//ADVANCED property for variable: OPENGL_xmesa_INCLUDE_DIR
OPENGL_xmesa_INCLUDE_DIR-ADVANCED:INTERNAL=1
//ADVANCED property for variable: OPENNI2_INCLUDE_DIRS
OPENNI2_INCLUDE_DIRS-ADVANCED:INTERNAL=1
//ADVANCED property for variable: OPENNI2_LIBRARY
OPENNI2_LIBRARY-ADVANCED:INTERNAL=1
//ADVANCED property for variable: OPENNI_INCLUDE_DIR
OPENNI_INCLUDE_DIR-ADVANCED:INTERNAL=1
//ADVANCED property for variable: OPENNI_LIBRARY
OPENNI_LIBRARY-ADVANCED:INTERNAL=1
//ADVANCED property for variable: OpenMP_CXX_FLAGS
OpenMP_CXX_FLAGS-ADVANCED:INTERNAL=1
//ADVANCED property for variable: OpenMP_C_FLAGS
OpenMP_C_FLAGS-ADVANCED:INTERNAL=1
//Test OpenMP_FLAG_DETECTED
OpenMP_FLAG_DETECTED:INTERNAL=1
PCL_APPS_SUBSYS:INTERNAL=
//Map value
PCL_APPS_SUBSYS_DESC_cloud_composer:INTERNAL=Cloud Composer - Application for Manipulating Point Clouds
//Map value
PCL_APPS_SUBSYS_DESC_in_hand_scanner:INTERNAL=Application examples/samples that show how PCL works
//Map value
PCL_APPS_SUBSYS_DESC_modeler:INTERNAL=Application examples/samples that show how PCL works
//Map value
PCL_APPS_SUBSYS_DESC_optronic_viewer:INTERNAL=PCL Optronic Viewer
//Map value
PCL_APPS_SUBSYS_DESC_point_cloud_editor:INTERNAL=Application examples/samples that show how PCL works
//ADVANCED property for variable: PCL_BUILD_WITH_BOOST_DYNAMIC_LINKING_WIN32
PCL_BUILD_WITH_BOOST_DYNAMIC_LINKING_WIN32-ADVANCED:INTERNAL=1
//ADVANCED property for variable: PCL_ENABLE_SSE
PCL_ENABLE_SSE-ADVANCED:INTERNAL=1
//ADVANCED property for variable: PCL_NO_PRECOMPILE
PCL_NO_PRECOMPILE-ADVANCED:INTERNAL=1
//ADVANCED property for variable: PCL_ONLY_CORE_POINT_TYPES
PCL_ONLY_CORE_POINT_TYPES-ADVANCED:INTERNAL=1
//ADVANCED property for variable: PCL_SHARED_LIBS
PCL_SHARED_LIBS-ADVANCED:INTERNAL=1
//Internal list of subsystems
PCL_SUBSYSTEMS:INTERNAL=
//A depends on B and C.
PCL_SUBSYS_DEPS:INTERNAL=
//Map value
PCL_SUBSYS_DEPS_apps:INTERNAL=common;geometry;io;filters;sample_consensus;segmentation;visualization;kdtree;features;surface;octree;registration;keypoints;tracking;search;recognition
//Map value
PCL_SUBSYS_DEPS_apps_cloud_composer:INTERNAL=common;io;visualization;filters;apps
//Map value
PCL_SUBSYS_DEPS_apps_in_hand_scanner:INTERNAL=common;features;io;kdtree;apps
//Map value
PCL_SUBSYS_DEPS_apps_modeler:INTERNAL=common;geometry;io;filters;sample_consensus;segmentation;visualization;kdtree;features;surface;octree;registration;keypoints;tracking;search;apps
//Map value
PCL_SUBSYS_DEPS_apps_optronic_viewer:INTERNAL=common;geometry;io;filters;sample_consensus;segmentation;visualization;kdtree;features;surface;octree;registration;keypoints;tracking;search;apps
//Map value
PCL_SUBSYS_DEPS_apps_point_cloud_editor:INTERNAL=common;filters;io;apps
//Map value
PCL_SUBSYS_DEPS_examples:INTERNAL=visualization;geometry;surface
//Map value
PCL_SUBSYS_DEPS_features:INTERNAL=common;search;kdtree;octree;filters
//Map value
PCL_SUBSYS_DEPS_filters:INTERNAL=common;sample_consensus;search;kdtree;octree
//Map value
PCL_SUBSYS_DEPS_geometry:INTERNAL=common
//Map value
PCL_SUBSYS_DEPS_global_tests:INTERNAL=common;sample_consensus;io;kdtree;features;filters;geometry;keypoints;search;surface;registration;segmentation;octree;recognition;people;outofcore;visualization
//Map value
PCL_SUBSYS_DEPS_io:INTERNAL=common;octree
//Map value
PCL_SUBSYS_DEPS_kdtree:INTERNAL=common
//Map value
PCL_SUBSYS_DEPS_keypoints:INTERNAL=common;search;kdtree;octree;features;filters
//Map value
PCL_SUBSYS_DEPS_octree:INTERNAL=common
//Map value
PCL_SUBSYS_DEPS_outofcore:INTERNAL=common;io;filters;octree;visualization
//Map value
PCL_SUBSYS_DEPS_people:INTERNAL=common;kdtree;search;features;sample_consensus;filters;io;visualization;geometry;segmentation;octree
//Map value
PCL_SUBSYS_DEPS_recognition:INTERNAL=common;io;search;kdtree;octree;features;filters;registration;sample_consensus
//Map value
PCL_SUBSYS_DEPS_registration:INTERNAL=common;octree;kdtree;search;sample_consensus;features;filters
//Map value
PCL_SUBSYS_DEPS_sample_consensus:INTERNAL=common;search
//Map value
PCL_SUBSYS_DEPS_search:INTERNAL=common;kdtree;octree
//Map value
PCL_SUBSYS_DEPS_segmentation:INTERNAL=common;geometry;search;sample_consensus;kdtree;octree;features;filters
//Map value
PCL_SUBSYS_DEPS_surface:INTERNAL=common;search;kdtree;octree
//Map value
PCL_SUBSYS_DEPS_tools:INTERNAL=visualization
//Map value
PCL_SUBSYS_DEPS_tracking:INTERNAL=common;search;kdtree;filters;octree
//Map value
PCL_SUBSYS_DEPS_visualization:INTERNAL=common;io;kdtree;geometry;search
//Subsystem descriptions
PCL_SUBSYS_DESC:INTERNAL=
//Map value
PCL_SUBSYS_DESC_apps:INTERNAL=Application examples/samples that show how PCL works
//Map value
PCL_SUBSYS_DESC_common:INTERNAL=Point cloud common library
//Map value
PCL_SUBSYS_DESC_examples:INTERNAL=PCL examples
//Map value
PCL_SUBSYS_DESC_features:INTERNAL=Point cloud features library
//Map value
PCL_SUBSYS_DESC_filters:INTERNAL=Point cloud filters library
//Map value
PCL_SUBSYS_DESC_geometry:INTERNAL=Point cloud geometry library
//Map value
PCL_SUBSYS_DESC_global_tests:INTERNAL=Point cloud library global unit tests
//Map value
PCL_SUBSYS_DESC_io:INTERNAL=Point cloud IO library
//Map value
PCL_SUBSYS_DESC_kdtree:INTERNAL=Point cloud kd-tree library
//Map value
PCL_SUBSYS_DESC_keypoints:INTERNAL=Point cloud keypoints library
//Map value
PCL_SUBSYS_DESC_octree:INTERNAL=Point cloud octree library
//Map value
PCL_SUBSYS_DESC_outofcore:INTERNAL=Point cloud outofcore library
//Map value
PCL_SUBSYS_DESC_people:INTERNAL=Point cloud people library
//Map value
PCL_SUBSYS_DESC_recognition:INTERNAL=Point cloud recognition library
//Map value
PCL_SUBSYS_DESC_registration:INTERNAL=Point cloud registration library
//Map value
PCL_SUBSYS_DESC_sample_consensus:INTERNAL=Point cloud sample consensus library
//Map value
PCL_SUBSYS_DESC_search:INTERNAL=Point cloud generic search library
//Map value
PCL_SUBSYS_DESC_segmentation:INTERNAL=Point cloud segmentation library
//Map value
PCL_SUBSYS_DESC_surface:INTERNAL=Point cloud surface library
//Map value
PCL_SUBSYS_DESC_tools:INTERNAL=Useful PCL-based command line tools
//Map value
PCL_SUBSYS_DESC_tracking:INTERNAL=Point cloud tracking library
//Map value
PCL_SUBSYS_DESC_visualization:INTERNAL=Point cloud visualization library
//A depends on B and C.
PCL_SUBSYS_EXT_DEPS:INTERNAL=
//Map value
PCL_SUBSYS_EXT_DEPS_common:INTERNAL=eigen;boost
//Map value
PCL_SUBSYS_EXT_DEPS_examples:INTERNAL=vtk
//Map value
PCL_SUBSYS_EXT_DEPS_kdtree:INTERNAL=flann
//Map value
PCL_SUBSYS_EXT_DEPS_search:INTERNAL=flann
//Map value
PCL_SUBSYS_EXT_DEPS_visualization:INTERNAL=vtk
//To Build Or Not To Build, That Is The Question.
PCL_SUBSYS_HYPERSTATUS:INTERNAL=
//A depends on B and C.
PCL_SUBSYS_OPT_DEPS:INTERNAL=
//Map value
PCL_SUBSYS_OPT_DEPS_apps:INTERNAL=openni;vtk
//Map value
PCL_SUBSYS_OPT_DEPS_global_tests:INTERNAL=vtk
//Map value
PCL_SUBSYS_OPT_DEPS_io:INTERNAL=openni;openni2;pcap;png;vtk;libusb-1.0
//Map value
PCL_SUBSYS_OPT_DEPS_surface:INTERNAL=qhull
//Map value
PCL_SUBSYS_OPT_DEPS_visualization:INTERNAL=openni;openni2
//But why?
PCL_SUBSYS_REASONS:INTERNAL=
//Map value
PCL_SUBSYS_REASONS_apps:INTERNAL=No reason
//Map value
PCL_SUBSYS_REASONS_apps_cloud_composer:INTERNAL=No reason
//Map value
PCL_SUBSYS_REASONS_apps_in_hand_scanner:INTERNAL=No reason
//Map value
PCL_SUBSYS_REASONS_apps_modeler:INTERNAL=No reason
//Map value
PCL_SUBSYS_REASONS_apps_optronic_viewer:INTERNAL=FZAPI was not found.
//Map value
PCL_SUBSYS_REASONS_apps_point_cloud_editor:INTERNAL=No reason
//Map value
PCL_SUBSYS_REASONS_common:INTERNAL=No reason
//Map value
PCL_SUBSYS_REASONS_examples:INTERNAL=No reason
//Map value
PCL_SUBSYS_REASONS_features:INTERNAL=No reason
//Map value
PCL_SUBSYS_REASONS_filters:INTERNAL=No reason
//Map value
PCL_SUBSYS_REASONS_geometry:INTERNAL=No reason
//Map value
PCL_SUBSYS_REASONS_global_tests:INTERNAL=No reason
//Map value
PCL_SUBSYS_REASONS_io:INTERNAL=No reason
//Map value
PCL_SUBSYS_REASONS_kdtree:INTERNAL=No reason
//Map value
PCL_SUBSYS_REASONS_keypoints:INTERNAL=No reason
//Map value
PCL_SUBSYS_REASONS_octree:INTERNAL=No reason
//Map value
PCL_SUBSYS_REASONS_outofcore:INTERNAL=No reason
//Map value
PCL_SUBSYS_REASONS_people:INTERNAL=No reason
//Map value
PCL_SUBSYS_REASONS_recognition:INTERNAL=No reason
//Map value
PCL_SUBSYS_REASONS_registration:INTERNAL=No reason
//Map value
PCL_SUBSYS_REASONS_sample_consensus:INTERNAL=No reason
//Map value
PCL_SUBSYS_REASONS_search:INTERNAL=No reason
//Map value
PCL_SUBSYS_REASONS_segmentation:INTERNAL=No reason
//Map value
PCL_SUBSYS_REASONS_surface:INTERNAL=No reason
//Map value
PCL_SUBSYS_REASONS_tools:INTERNAL=No reason
//Map value
PCL_SUBSYS_REASONS_tracking:INTERNAL=No reason
//Map value
PCL_SUBSYS_REASONS_visualization:INTERNAL=No reason
//To build or not to build, that is the question.
PCL_SUBSYS_STATUS:INTERNAL=
//Map value
PCL_SUBSYS_STATUS_apps:INTERNAL=TRUE
//Map value
PCL_SUBSYS_STATUS_apps_cloud_composer:INTERNAL=TRUE
//Map value
PCL_SUBSYS_STATUS_apps_in_hand_scanner:INTERNAL=TRUE
//Map value
PCL_SUBSYS_STATUS_apps_modeler:INTERNAL=TRUE
//Map value
PCL_SUBSYS_STATUS_apps_optronic_viewer:INTERNAL=FALSE
//Map value
PCL_SUBSYS_STATUS_apps_point_cloud_editor:INTERNAL=TRUE
//Map value
PCL_SUBSYS_STATUS_common:INTERNAL=TRUE
//Map value
PCL_SUBSYS_STATUS_examples:INTERNAL=TRUE
//Map value
PCL_SUBSYS_STATUS_features:INTERNAL=TRUE
//Map value
PCL_SUBSYS_STATUS_filters:INTERNAL=TRUE
//Map value
PCL_SUBSYS_STATUS_geometry:INTERNAL=TRUE
//Map value
PCL_SUBSYS_STATUS_global_tests:INTERNAL=TRUE
//Map value
PCL_SUBSYS_STATUS_io:INTERNAL=TRUE
//Map value
PCL_SUBSYS_STATUS_kdtree:INTERNAL=TRUE
//Map value
PCL_SUBSYS_STATUS_keypoints:INTERNAL=TRUE
//Map value
PCL_SUBSYS_STATUS_octree:INTERNAL=TRUE
//Map value
PCL_SUBSYS_STATUS_outofcore:INTERNAL=TRUE
//Map value
PCL_SUBSYS_STATUS_people:INTERNAL=TRUE
//Map value
PCL_SUBSYS_STATUS_recognition:INTERNAL=TRUE
//Map value
PCL_SUBSYS_STATUS_registration:INTERNAL=TRUE
//Map value
PCL_SUBSYS_STATUS_sample_consensus:INTERNAL=TRUE
//Map value
PCL_SUBSYS_STATUS_search:INTERNAL=TRUE
//Map value
PCL_SUBSYS_STATUS_segmentation:INTERNAL=TRUE
//Map value
PCL_SUBSYS_STATUS_surface:INTERNAL=TRUE
//Map value
PCL_SUBSYS_STATUS_tools:INTERNAL=TRUE
//Map value
PCL_SUBSYS_STATUS_tracking:INTERNAL=TRUE
//Map value
PCL_SUBSYS_STATUS_visualization:INTERNAL=TRUE
PC_EIGEN_CFLAGS:INTERNAL=-I/usr/include/eigen3
PC_EIGEN_CFLAGS_I:INTERNAL=
PC_EIGEN_CFLAGS_OTHER:INTERNAL=
PC_EIGEN_FOUND:INTERNAL=1
PC_EIGEN_INCLUDEDIR:INTERNAL=
PC_EIGEN_INCLUDE_DIRS:INTERNAL=/usr/include/eigen3
PC_EIGEN_LDFLAGS:INTERNAL=
PC_EIGEN_LDFLAGS_OTHER:INTERNAL=
PC_EIGEN_LIBDIR:INTERNAL=
PC_EIGEN_LIBRARIES:INTERNAL=
PC_EIGEN_LIBRARY_DIRS:INTERNAL=
PC_EIGEN_LIBS:INTERNAL=
PC_EIGEN_LIBS_L:INTERNAL=
PC_EIGEN_LIBS_OTHER:INTERNAL=
PC_EIGEN_LIBS_PATHS:INTERNAL=
PC_EIGEN_PREFIX:INTERNAL=
PC_EIGEN_STATIC_CFLAGS:INTERNAL=-I/usr/include/eigen3
PC_EIGEN_STATIC_CFLAGS_I:INTERNAL=
PC_EIGEN_STATIC_CFLAGS_OTHER:INTERNAL=
PC_EIGEN_STATIC_INCLUDE_DIRS:INTERNAL=/usr/include/eigen3
PC_EIGEN_STATIC_LDFLAGS:INTERNAL=
PC_EIGEN_STATIC_LDFLAGS_OTHER:INTERNAL=
PC_EIGEN_STATIC_LIBDIR:INTERNAL=
PC_EIGEN_STATIC_LIBRARIES:INTERNAL=
PC_EIGEN_STATIC_LIBRARY_DIRS:INTERNAL=
PC_EIGEN_STATIC_LIBS:INTERNAL=
PC_EIGEN_STATIC_LIBS_L:INTERNAL=
PC_EIGEN_STATIC_LIBS_OTHER:INTERNAL=
PC_EIGEN_STATIC_LIBS_PATHS:INTERNAL=
PC_EIGEN_VERSION:INTERNAL=3.2.0
PC_EIGEN_eigen3_INCLUDEDIR:INTERNAL=
PC_EIGEN_eigen3_LIBDIR:INTERNAL=
PC_EIGEN_eigen3_PREFIX:INTERNAL=
PC_EIGEN_eigen3_VERSION:INTERNAL=
PC_FLANN_CFLAGS:INTERNAL=
PC_FLANN_CFLAGS_I:INTERNAL=
PC_FLANN_CFLAGS_OTHER:INTERNAL=
PC_FLANN_FOUND:INTERNAL=1
PC_FLANN_INCLUDEDIR:INTERNAL=/usr/include
PC_FLANN_INCLUDE_DIRS:INTERNAL=
PC_FLANN_LDFLAGS:INTERNAL=-lflann_cpp
PC_FLANN_LDFLAGS_OTHER:INTERNAL=
PC_FLANN_LIBDIR:INTERNAL=/usr/lib/x86_64-linux-gnu
PC_FLANN_LIBRARIES:INTERNAL=flann_cpp
PC_FLANN_LIBRARY_DIRS:INTERNAL=
PC_FLANN_LIBS:INTERNAL=
PC_FLANN_LIBS_L:INTERNAL=
PC_FLANN_LIBS_OTHER:INTERNAL=
PC_FLANN_LIBS_PATHS:INTERNAL=
PC_FLANN_PREFIX:INTERNAL=/usr
PC_FLANN_STATIC_CFLAGS:INTERNAL=
PC_FLANN_STATIC_CFLAGS_I:INTERNAL=
PC_FLANN_STATIC_CFLAGS_OTHER:INTERNAL=
PC_FLANN_STATIC_INCLUDE_DIRS:INTERNAL=
PC_FLANN_STATIC_LDFLAGS:INTERNAL=-lflann_cpp
PC_FLANN_STATIC_LDFLAGS_OTHER:INTERNAL=
PC_FLANN_STATIC_LIBDIR:INTERNAL=
PC_FLANN_STATIC_LIBRARIES:INTERNAL=flann_cpp
PC_FLANN_STATIC_LIBRARY_DIRS:INTERNAL=
PC_FLANN_STATIC_LIBS:INTERNAL=
PC_FLANN_STATIC_LIBS_L:INTERNAL=
PC_FLANN_STATIC_LIBS_OTHER:INTERNAL=
PC_FLANN_STATIC_LIBS_PATHS:INTERNAL=
PC_FLANN_VERSION:INTERNAL=1.8.4
PC_FLANN_flann_INCLUDEDIR:INTERNAL=
PC_FLANN_flann_LIBDIR:INTERNAL=
PC_FLANN_flann_PREFIX:INTERNAL=
PC_FLANN_flann_VERSION:INTERNAL=
PC_OPENNI2_CFLAGS:INTERNAL=
PC_OPENNI2_CFLAGS_I:INTERNAL=
PC_OPENNI2_CFLAGS_OTHER:INTERNAL=
PC_OPENNI2_FOUND:INTERNAL=
PC_OPENNI2_INCLUDEDIR:INTERNAL=
PC_OPENNI2_LIBDIR:INTERNAL=
PC_OPENNI2_LIBS:INTERNAL=
PC_OPENNI2_LIBS_L:INTERNAL=
PC_OPENNI2_LIBS_OTHER:INTERNAL=
PC_OPENNI2_LIBS_PATHS:INTERNAL=
PC_OPENNI2_PREFIX:INTERNAL=
PC_OPENNI2_STATIC_CFLAGS:INTERNAL=
PC_OPENNI2_STATIC_CFLAGS_I:INTERNAL=
PC_OPENNI2_STATIC_CFLAGS_OTHER:INTERNAL=
PC_OPENNI2_STATIC_LIBDIR:INTERNAL=
PC_OPENNI2_STATIC_LIBS:INTERNAL=
PC_OPENNI2_STATIC_LIBS_L:INTERNAL=
PC_OPENNI2_STATIC_LIBS_OTHER:INTERNAL=
PC_OPENNI2_STATIC_LIBS_PATHS:INTERNAL=
PC_OPENNI2_VERSION:INTERNAL=
PC_OPENNI2_openni2-dev_INCLUDEDIR:INTERNAL=
PC_OPENNI2_openni2-dev_LIBDIR:INTERNAL=
PC_OPENNI2_openni2-dev_PREFIX:INTERNAL=
PC_OPENNI2_openni2-dev_VERSION:INTERNAL=
PC_OPENNI_CFLAGS:INTERNAL=
PC_OPENNI_CFLAGS_I:INTERNAL=
PC_OPENNI_CFLAGS_OTHER:INTERNAL=
PC_OPENNI_FOUND:INTERNAL=
PC_OPENNI_INCLUDEDIR:INTERNAL=
PC_OPENNI_LIBDIR:INTERNAL=
PC_OPENNI_LIBS:INTERNAL=
PC_OPENNI_LIBS_L:INTERNAL=
PC_OPENNI_LIBS_OTHER:INTERNAL=
PC_OPENNI_LIBS_PATHS:INTERNAL=
PC_OPENNI_PREFIX:INTERNAL=
PC_OPENNI_STATIC_CFLAGS:INTERNAL=
PC_OPENNI_STATIC_CFLAGS_I:INTERNAL=
PC_OPENNI_STATIC_CFLAGS_OTHER:INTERNAL=
PC_OPENNI_STATIC_LIBDIR:INTERNAL=
PC_OPENNI_STATIC_LIBS:INTERNAL=
PC_OPENNI_STATIC_LIBS_L:INTERNAL=
PC_OPENNI_STATIC_LIBS_OTHER:INTERNAL=
PC_OPENNI_STATIC_LIBS_PATHS:INTERNAL=
PC_OPENNI_VERSION:INTERNAL=
PC_OPENNI_openni-dev_INCLUDEDIR:INTERNAL=
PC_OPENNI_openni-dev_LIBDIR:INTERNAL=
PC_OPENNI_openni-dev_PREFIX:INTERNAL=
PC_OPENNI_openni-dev_VERSION:INTERNAL=
PC_SPHINX_CFLAGS:INTERNAL=
PC_SPHINX_CFLAGS_I:INTERNAL=
PC_SPHINX_CFLAGS_OTHER:INTERNAL=
PC_SPHINX_FOUND:INTERNAL=
PC_SPHINX_INCLUDEDIR:INTERNAL=
PC_SPHINX_LIBDIR:INTERNAL=
PC_SPHINX_LIBS:INTERNAL=
PC_SPHINX_LIBS_L:INTERNAL=
PC_SPHINX_LIBS_OTHER:INTERNAL=
PC_SPHINX_LIBS_PATHS:INTERNAL=
PC_SPHINX_PREFIX:INTERNAL=
PC_SPHINX_STATIC_CFLAGS:INTERNAL=
PC_SPHINX_STATIC_CFLAGS_I:INTERNAL=
PC_SPHINX_STATIC_CFLAGS_OTHER:INTERNAL=
PC_SPHINX_STATIC_LIBDIR:INTERNAL=
PC_SPHINX_STATIC_LIBS:INTERNAL=
PC_SPHINX_STATIC_LIBS_L:INTERNAL=
PC_SPHINX_STATIC_LIBS_OTHER:INTERNAL=
PC_SPHINX_STATIC_LIBS_PATHS:INTERNAL=
PC_SPHINX_VERSION:INTERNAL=
PC_SPHINX_sphinx-build_INCLUDEDIR:INTERNAL=
PC_SPHINX_sphinx-build_LIBDIR:INTERNAL=
PC_SPHINX_sphinx-build_PREFIX:INTERNAL=
PC_SPHINX_sphinx-build_VERSION:INTERNAL=
PC_USB_10_CFLAGS:INTERNAL=-I/usr/include/libusb-1.0
PC_USB_10_CFLAGS_I:INTERNAL=
PC_USB_10_CFLAGS_OTHER:INTERNAL=
PC_USB_10_FOUND:INTERNAL=1
PC_USB_10_INCLUDEDIR:INTERNAL=/usr/include
PC_USB_10_INCLUDE_DIRS:INTERNAL=/usr/include/libusb-1.0
PC_USB_10_LDFLAGS:INTERNAL=-lusb-1.0
PC_USB_10_LDFLAGS_OTHER:INTERNAL=
PC_USB_10_LIBDIR:INTERNAL=/usr/lib/x86_64-linux-gnu
PC_USB_10_LIBRARIES:INTERNAL=usb-1.0
PC_USB_10_LIBRARY_DIRS:INTERNAL=
PC_USB_10_LIBS:INTERNAL=
PC_USB_10_LIBS_L:INTERNAL=
PC_USB_10_LIBS_OTHER:INTERNAL=
PC_USB_10_LIBS_PATHS:INTERNAL=
PC_USB_10_PREFIX:INTERNAL=/usr
PC_USB_10_STATIC_CFLAGS:INTERNAL=-I/usr/include/libusb-1.0
PC_USB_10_STATIC_CFLAGS_I:INTERNAL=
PC_USB_10_STATIC_CFLAGS_OTHER:INTERNAL=
PC_USB_10_STATIC_INCLUDE_DIRS:INTERNAL=/usr/include/libusb-1.0
PC_USB_10_STATIC_LDFLAGS:INTERNAL=-pthread;-lusb-1.0;-ludev
PC_USB_10_STATIC_LDFLAGS_OTHER:INTERNAL=-pthread
PC_USB_10_STATIC_LIBDIR:INTERNAL=
PC_USB_10_STATIC_LIBRARIES:INTERNAL=usb-1.0;udev
PC_USB_10_STATIC_LIBRARY_DIRS:INTERNAL=
PC_USB_10_STATIC_LIBS:INTERNAL=
PC_USB_10_STATIC_LIBS_L:INTERNAL=
PC_USB_10_STATIC_LIBS_OTHER:INTERNAL=
PC_USB_10_STATIC_LIBS_PATHS:INTERNAL=
PC_USB_10_VERSION:INTERNAL=1.0.17
PC_USB_10_libusb-1.0_INCLUDEDIR:INTERNAL=
PC_USB_10_libusb-1.0_LIBDIR:INTERNAL=
PC_USB_10_libusb-1.0_PREFIX:INTERNAL=
PC_USB_10_libusb-1.0_VERSION:INTERNAL=
//ADVANCED property for variable: PKG_CONFIG_EXECUTABLE
PKG_CONFIG_EXECUTABLE-ADVANCED:INTERNAL=1
//ADVANCED property for variable: PNG_LIBRARY_DEBUG
PNG_LIBRARY_DEBUG-ADVANCED:INTERNAL=1
//ADVANCED property for variable: PNG_LIBRARY_RELEASE
PNG_LIBRARY_RELEASE-ADVANCED:INTERNAL=1
//ADVANCED property for variable: PNG_PNG_INCLUDE_DIR
PNG_PNG_INCLUDE_DIR-ADVANCED:INTERNAL=1
//ADVANCED property for variable: PYTHON_EXECUTABLE
PYTHON_EXECUTABLE-ADVANCED:INTERNAL=1
//QHull header
QHULL_HEADER:INTERNAL=/usr/include/libqhull/libqhull.h
//ADVANCED property for variable: QHULL_INCLUDE_DIR
QHULL_INCLUDE_DIR-ADVANCED:INTERNAL=1
//ADVANCED property for variable: QHULL_LIBRARY
QHULL_LIBRARY-ADVANCED:INTERNAL=1
//ADVANCED property for variable: QHULL_LIBRARY_DEBUG
QHULL_LIBRARY_DEBUG-ADVANCED:INTERNAL=1
//ADVANCED property for variable: QT_ARTHURPLUGIN_PLUGIN_DEBUG
QT_ARTHURPLUGIN_PLUGIN_DEBUG-ADVANCED:INTERNAL=1
//ADVANCED property for variable: QT_ARTHURPLUGIN_PLUGIN_RELEASE
QT_ARTHURPLUGIN_PLUGIN_RELEASE-ADVANCED:INTERNAL=1
QT_BINARY_DIR:INTERNAL=/usr/lib/x86_64-linux-gnu/qt4/bin
//ADVANCED property for variable: QT_CONTAINEREXTENSION_PLUGIN_DEBUG
QT_CONTAINEREXTENSION_PLUGIN_DEBUG-ADVANCED:INTERNAL=1
//ADVANCED property for variable: QT_CONTAINEREXTENSION_PLUGIN_RELEASE
QT_CONTAINEREXTENSION_PLUGIN_RELEASE-ADVANCED:INTERNAL=1
//ADVANCED property for variable: QT_CUSTOMWIDGETPLUGIN_PLUGIN_DEBUG
QT_CUSTOMWIDGETPLUGIN_PLUGIN_DEBUG-ADVANCED:INTERNAL=1
//ADVANCED property for variable: QT_CUSTOMWIDGETPLUGIN_PLUGIN_RELEASE
QT_CUSTOMWIDGETPLUGIN_PLUGIN_RELEASE-ADVANCED:INTERNAL=1
//ADVANCED property for variable: QT_DBUSCPP2XML_EXECUTABLE
QT_DBUSCPP2XML_EXECUTABLE-ADVANCED:INTERNAL=1
//ADVANCED property for variable: QT_DBUSXML2CPP_EXECUTABLE
QT_DBUSXML2CPP_EXECUTABLE-ADVANCED:INTERNAL=1
//ADVANCED property for variable: QT_DESIGNER_EXECUTABLE
QT_DESIGNER_EXECUTABLE-ADVANCED:INTERNAL=1
//ADVANCED property for variable: QT_DOC_DIR
QT_DOC_DIR-ADVANCED:INTERNAL=1
QT_HEADERS_DIR:INTERNAL=/usr/include/qt4
//ADVANCED property for variable: QT_LIBRARY_DIR
QT_LIBRARY_DIR-ADVANCED:INTERNAL=1
//Qt library dir
QT_LIBRARY_DIR:INTERNAL=/usr/lib/x86_64-linux-gnu
//ADVANCED property for variable: QT_LINGUIST_EXECUTABLE
QT_LINGUIST_EXECUTABLE-ADVANCED:INTERNAL=1
//ADVANCED property for variable: QT_LRELEASE_EXECUTABLE
QT_LRELEASE_EXECUTABLE-ADVANCED:INTERNAL=1
//ADVANCED property for variable: QT_LUPDATE_EXECUTABLE
QT_LUPDATE_EXECUTABLE-ADVANCED:INTERNAL=1
//ADVANCED property for variable: QT_MKSPECS_DIR
QT_MKSPECS_DIR-ADVANCED:INTERNAL=1
//ADVANCED property for variable: QT_MOC_EXECUTABLE
QT_MOC_EXECUTABLE-ADVANCED:INTERNAL=1
//ADVANCED property for variable: QT_PHONONWIDGETS_PLUGIN_DEBUG
QT_PHONONWIDGETS_PLUGIN_DEBUG-ADVANCED:INTERNAL=1
//ADVANCED property for variable: QT_PHONONWIDGETS_PLUGIN_RELEASE
QT_PHONONWIDGETS_PLUGIN_RELEASE-ADVANCED:INTERNAL=1
//ADVANCED property for variable: QT_PHONON_INCLUDE_DIR
QT_PHONON_INCLUDE_DIR-ADVANCED:INTERNAL=1
//ADVANCED property for variable: QT_PHONON_LIBRARY
QT_PHONON_LIBRARY-ADVANCED:INTERNAL=1
//ADVANCED property for variable: QT_PHONON_LIBRARY_DEBUG
QT_PHONON_LIBRARY_DEBUG-ADVANCED:INTERNAL=1
//ADVANCED property for variable: QT_PHONON_LIBRARY_RELEASE
QT_PHONON_LIBRARY_RELEASE-ADVANCED:INTERNAL=1
//ADVANCED property for variable: QT_PLUGINS_DIR
QT_PLUGINS_DIR-ADVANCED:INTERNAL=1
//ADVANCED property for variable: QT_QCNCODECS_PLUGIN_DEBUG
QT_QCNCODECS_PLUGIN_DEBUG-ADVANCED:INTERNAL=1
//ADVANCED property for variable: QT_QCNCODECS_PLUGIN_RELEASE
QT_QCNCODECS_PLUGIN_RELEASE-ADVANCED:INTERNAL=1
//ADVANCED property for variable: QT_QCOLLECTIONGENERATOR_EXECUTABLE
QT_QCOLLECTIONGENERATOR_EXECUTABLE-ADVANCED:INTERNAL=1
//ADVANCED property for variable: QT_QCOREWLANBEARER_PLUGIN_DEBUG
QT_QCOREWLANBEARER_PLUGIN_DEBUG-ADVANCED:INTERNAL=1
//ADVANCED property for variable: QT_QCOREWLANBEARER_PLUGIN_RELEASE
QT_QCOREWLANBEARER_PLUGIN_RELEASE-ADVANCED:INTERNAL=1
//ADVANCED property for variable: QT_QDECLARATIVEVIEW_PLUGIN_DEBUG
QT_QDECLARATIVEVIEW_PLUGIN_DEBUG-ADVANCED:INTERNAL=1
//ADVANCED property for variable: QT_QDECLARATIVEVIEW_PLUGIN_RELEASE
QT_QDECLARATIVEVIEW_PLUGIN_RELEASE-ADVANCED:INTERNAL=1
//ADVANCED property for variable: QT_QDECORATIONDEFAULT_PLUGIN_DEBUG
QT_QDECORATIONDEFAULT_PLUGIN_DEBUG-ADVANCED:INTERNAL=1
//ADVANCED property for variable: QT_QDECORATIONDEFAULT_PLUGIN_RELEASE
QT_QDECORATIONDEFAULT_PLUGIN_RELEASE-ADVANCED:INTERNAL=1
//ADVANCED property for variable: QT_QDECORATIONWINDOWS_PLUGIN_DEBUG
QT_QDECORATIONWINDOWS_PLUGIN_DEBUG-ADVANCED:INTERNAL=1
//ADVANCED property for variable: QT_QDECORATIONWINDOWS_PLUGIN_RELEASE
QT_QDECORATIONWINDOWS_PLUGIN_RELEASE-ADVANCED:INTERNAL=1
//ADVANCED property for variable: QT_QGENERICBEARER_PLUGIN_DEBUG
QT_QGENERICBEARER_PLUGIN_DEBUG-ADVANCED:INTERNAL=1
//ADVANCED property for variable: QT_QGENERICBEARER_PLUGIN_RELEASE
QT_QGENERICBEARER_PLUGIN_RELEASE-ADVANCED:INTERNAL=1
//ADVANCED property for variable: QT_QGIF_PLUGIN_DEBUG
QT_QGIF_PLUGIN_DEBUG-ADVANCED:INTERNAL=1
//ADVANCED property for variable: QT_QGIF_PLUGIN_RELEASE
QT_QGIF_PLUGIN_RELEASE-ADVANCED:INTERNAL=1
//ADVANCED property for variable: QT_QGLGRAPHICSSYSTEM_PLUGIN_DEBUG
QT_QGLGRAPHICSSYSTEM_PLUGIN_DEBUG-ADVANCED:INTERNAL=1
//ADVANCED property for variable: QT_QGLGRAPHICSSYSTEM_PLUGIN_RELEASE
QT_QGLGRAPHICSSYSTEM_PLUGIN_RELEASE-ADVANCED:INTERNAL=1
//ADVANCED property for variable: QT_QICO_PLUGIN_DEBUG
QT_QICO_PLUGIN_DEBUG-ADVANCED:INTERNAL=1
//ADVANCED property for variable: QT_QICO_PLUGIN_RELEASE
QT_QICO_PLUGIN_RELEASE-ADVANCED:INTERNAL=1
//ADVANCED property for variable: QT_QIMSW_MULTI_PLUGIN_DEBUG
QT_QIMSW_MULTI_PLUGIN_DEBUG-ADVANCED:INTERNAL=1
//ADVANCED property for variable: QT_QIMSW_MULTI_PLUGIN_RELEASE
QT_QIMSW_MULTI_PLUGIN_RELEASE-ADVANCED:INTERNAL=1
//ADVANCED property for variable: QT_QJPCODECS_PLUGIN_DEBUG
QT_QJPCODECS_PLUGIN_DEBUG-ADVANCED:INTERNAL=1
//ADVANCED property for variable: QT_QJPCODECS_PLUGIN_RELEASE
QT_QJPCODECS_PLUGIN_RELEASE-ADVANCED:INTERNAL=1
//ADVANCED property for variable: QT_QJPEG_PLUGIN_DEBUG
QT_QJPEG_PLUGIN_DEBUG-ADVANCED:INTERNAL=1
//ADVANCED property for variable: QT_QJPEG_PLUGIN_RELEASE
QT_QJPEG_PLUGIN_RELEASE-ADVANCED:INTERNAL=1
//ADVANCED property for variable: QT_QKRCODECS_PLUGIN_DEBUG
QT_QKRCODECS_PLUGIN_DEBUG-ADVANCED:INTERNAL=1
//ADVANCED property for variable: QT_QKRCODECS_PLUGIN_RELEASE
QT_QKRCODECS_PLUGIN_RELEASE-ADVANCED:INTERNAL=1
//ADVANCED property for variable: QT_QMNG_PLUGIN_DEBUG
QT_QMNG_PLUGIN_DEBUG-ADVANCED:INTERNAL=1
//ADVANCED property for variable: QT_QMNG_PLUGIN_RELEASE
QT_QMNG_PLUGIN_RELEASE-ADVANCED:INTERNAL=1
//ADVANCED property for variable: QT_QSQLDB2_PLUGIN_DEBUG
QT_QSQLDB2_PLUGIN_DEBUG-ADVANCED:INTERNAL=1
//ADVANCED property for variable: QT_QSQLDB2_PLUGIN_RELEASE
QT_QSQLDB2_PLUGIN_RELEASE-ADVANCED:INTERNAL=1
//ADVANCED property for variable: QT_QSQLIBASE_PLUGIN_DEBUG
QT_QSQLIBASE_PLUGIN_DEBUG-ADVANCED:INTERNAL=1
//ADVANCED property for variable: QT_QSQLIBASE_PLUGIN_RELEASE
QT_QSQLIBASE_PLUGIN_RELEASE-ADVANCED:INTERNAL=1
//ADVANCED property for variable: QT_QSQLITE2_PLUGIN_DEBUG
QT_QSQLITE2_PLUGIN_DEBUG-ADVANCED:INTERNAL=1
//ADVANCED property for variable: QT_QSQLITE2_PLUGIN_RELEASE
QT_QSQLITE2_PLUGIN_RELEASE-ADVANCED:INTERNAL=1
//ADVANCED property for variable: QT_QSQLITE_PLUGIN_DEBUG
QT_QSQLITE_PLUGIN_DEBUG-ADVANCED:INTERNAL=1
//ADVANCED property for variable: QT_QSQLITE_PLUGIN_RELEASE
QT_QSQLITE_PLUGIN_RELEASE-ADVANCED:INTERNAL=1
//ADVANCED property for variable: QT_QSQLMYSQL_PLUGIN_DEBUG
QT_QSQLMYSQL_PLUGIN_DEBUG-ADVANCED:INTERNAL=1
//ADVANCED property for variable: QT_QSQLMYSQL_PLUGIN_RELEASE
QT_QSQLMYSQL_PLUGIN_RELEASE-ADVANCED:INTERNAL=1
//ADVANCED property for variable: QT_QSQLOCI_PLUGIN_DEBUG
QT_QSQLOCI_PLUGIN_DEBUG-ADVANCED:INTERNAL=1
//ADVANCED property for variable: QT_QSQLOCI_PLUGIN_RELEASE
QT_QSQLOCI_PLUGIN_RELEASE-ADVANCED:INTERNAL=1
//ADVANCED property for variable: QT_QSQLODBC_PLUGIN_DEBUG
QT_QSQLODBC_PLUGIN_DEBUG-ADVANCED:INTERNAL=1
//ADVANCED property for variable: QT_QSQLODBC_PLUGIN_RELEASE
QT_QSQLODBC_PLUGIN_RELEASE-ADVANCED:INTERNAL=1
//ADVANCED property for variable: QT_QSQLPSQL_PLUGIN_DEBUG
QT_QSQLPSQL_PLUGIN_DEBUG-ADVANCED:INTERNAL=1
//ADVANCED property for variable: QT_QSQLPSQL_PLUGIN_RELEASE
QT_QSQLPSQL_PLUGIN_RELEASE-ADVANCED:INTERNAL=1
//ADVANCED property for variable: QT_QSQLTDS_PLUGIN_DEBUG
QT_QSQLTDS_PLUGIN_DEBUG-ADVANCED:INTERNAL=1
//ADVANCED property for variable: QT_QSQLTDS_PLUGIN_RELEASE
QT_QSQLTDS_PLUGIN_RELEASE-ADVANCED:INTERNAL=1
//ADVANCED property for variable: QT_QSVGICON_PLUGIN_DEBUG
QT_QSVGICON_PLUGIN_DEBUG-ADVANCED:INTERNAL=1
//ADVANCED property for variable: QT_QSVGICON_PLUGIN_RELEASE
QT_QSVGICON_PLUGIN_RELEASE-ADVANCED:INTERNAL=1
//ADVANCED property for variable: QT_QSVG_PLUGIN_DEBUG
QT_QSVG_PLUGIN_DEBUG-ADVANCED:INTERNAL=1
//ADVANCED property for variable: QT_QSVG_PLUGIN_RELEASE
QT_QSVG_PLUGIN_RELEASE-ADVANCED:INTERNAL=1
//ADVANCED property for variable: QT_QT3SUPPORTWIDGETS_PLUGIN_DEBUG
QT_QT3SUPPORTWIDGETS_PLUGIN_DEBUG-ADVANCED:INTERNAL=1
//ADVANCED property for variable: QT_QT3SUPPORTWIDGETS_PLUGIN_RELEASE
QT_QT3SUPPORTWIDGETS_PLUGIN_RELEASE-ADVANCED:INTERNAL=1
//ADVANCED property for variable: QT_QT3SUPPORT_INCLUDE_DIR
QT_QT3SUPPORT_INCLUDE_DIR-ADVANCED:INTERNAL=1
//ADVANCED property for variable: QT_QT3SUPPORT_LIBRARY
QT_QT3SUPPORT_LIBRARY-ADVANCED:INTERNAL=1
//ADVANCED property for variable: QT_QT3SUPPORT_LIBRARY_DEBUG
QT_QT3SUPPORT_LIBRARY_DEBUG-ADVANCED:INTERNAL=1
//ADVANCED property for variable: QT_QT3SUPPORT_LIBRARY_RELEASE
QT_QT3SUPPORT_LIBRARY_RELEASE-ADVANCED:INTERNAL=1
//ADVANCED property for variable: QT_QTACCESSIBLECOMPATWIDGETS_PLUGIN_DEBUG
QT_QTACCESSIBLECOMPATWIDGETS_PLUGIN_DEBUG-ADVANCED:INTERNAL=1
//ADVANCED property for variable: QT_QTACCESSIBLECOMPATWIDGETS_PLUGIN_RELEASE
QT_QTACCESSIBLECOMPATWIDGETS_PLUGIN_RELEASE-ADVANCED:INTERNAL=1
//ADVANCED property for variable: QT_QTACCESSIBLEWIDGETS_PLUGIN_DEBUG
QT_QTACCESSIBLEWIDGETS_PLUGIN_DEBUG-ADVANCED:INTERNAL=1
//ADVANCED property for variable: QT_QTACCESSIBLEWIDGETS_PLUGIN_RELEASE
QT_QTACCESSIBLEWIDGETS_PLUGIN_RELEASE-ADVANCED:INTERNAL=1
//ADVANCED property for variable: QT_QTASSISTANTCLIENT_INCLUDE_DIR
QT_QTASSISTANTCLIENT_INCLUDE_DIR-ADVANCED:INTERNAL=1
//ADVANCED property for variable: QT_QTASSISTANTCLIENT_LIBRARY
QT_QTASSISTANTCLIENT_LIBRARY-ADVANCED:INTERNAL=1
//ADVANCED property for variable: QT_QTASSISTANTCLIENT_LIBRARY_DEBUG
QT_QTASSISTANTCLIENT_LIBRARY_DEBUG-ADVANCED:INTERNAL=1
//ADVANCED property for variable: QT_QTASSISTANTCLIENT_LIBRARY_RELEASE
QT_QTASSISTANTCLIENT_LIBRARY_RELEASE-ADVANCED:INTERNAL=1
//ADVANCED property for variable: QT_QTASSISTANT_INCLUDE_DIR
QT_QTASSISTANT_INCLUDE_DIR-ADVANCED:INTERNAL=1
//ADVANCED property for variable: QT_QTASSISTANT_LIBRARY
QT_QTASSISTANT_LIBRARY-ADVANCED:INTERNAL=1
//ADVANCED property for variable: QT_QTASSISTANT_LIBRARY_DEBUG
QT_QTASSISTANT_LIBRARY_DEBUG-ADVANCED:INTERNAL=1
//ADVANCED property for variable: QT_QTASSISTANT_LIBRARY_RELEASE
QT_QTASSISTANT_LIBRARY_RELEASE-ADVANCED:INTERNAL=1
//ADVANCED property for variable: QT_QTCLUCENE_LIBRARY
QT_QTCLUCENE_LIBRARY-ADVANCED:INTERNAL=1
//ADVANCED property for variable: QT_QTCLUCENE_LIBRARY_DEBUG
QT_QTCLUCENE_LIBRARY_DEBUG-ADVANCED:INTERNAL=1
//ADVANCED property for variable: QT_QTCLUCENE_LIBRARY_RELEASE
QT_QTCLUCENE_LIBRARY_RELEASE-ADVANCED:INTERNAL=1
//ADVANCED property for variable: QT_QTCORE_INCLUDE_DIR
QT_QTCORE_INCLUDE_DIR-ADVANCED:INTERNAL=1
//ADVANCED property for variable: QT_QTCORE_LIBRARY
QT_QTCORE_LIBRARY-ADVANCED:INTERNAL=1
//ADVANCED property for variable: QT_QTCORE_LIBRARY_DEBUG
QT_QTCORE_LIBRARY_DEBUG-ADVANCED:INTERNAL=1
//ADVANCED property for variable: QT_QTCORE_LIBRARY_RELEASE
QT_QTCORE_LIBRARY_RELEASE-ADVANCED:INTERNAL=1
//ADVANCED property for variable: QT_QTDBUS_INCLUDE_DIR
QT_QTDBUS_INCLUDE_DIR-ADVANCED:INTERNAL=1
//ADVANCED property for variable: QT_QTDBUS_LIBRARY
QT_QTDBUS_LIBRARY-ADVANCED:INTERNAL=1
//ADVANCED property for variable: QT_QTDBUS_LIBRARY_DEBUG
QT_QTDBUS_LIBRARY_DEBUG-ADVANCED:INTERNAL=1
//ADVANCED property for variable: QT_QTDBUS_LIBRARY_RELEASE
QT_QTDBUS_LIBRARY_RELEASE-ADVANCED:INTERNAL=1
//ADVANCED property for variable: QT_QTDECLARATIVE_INCLUDE_DIR
QT_QTDECLARATIVE_INCLUDE_DIR-ADVANCED:INTERNAL=1
//ADVANCED property for variable: QT_QTDECLARATIVE_LIBRARY
QT_QTDECLARATIVE_LIBRARY-ADVANCED:INTERNAL=1
//ADVANCED property for variable: QT_QTDECLARATIVE_LIBRARY_DEBUG
QT_QTDECLARATIVE_LIBRARY_DEBUG-ADVANCED:INTERNAL=1
//ADVANCED property for variable: QT_QTDECLARATIVE_LIBRARY_RELEASE
QT_QTDECLARATIVE_LIBRARY_RELEASE-ADVANCED:INTERNAL=1
//ADVANCED property for variable: QT_QTDESIGNERCOMPONENTS_INCLUDE_DIR
QT_QTDESIGNERCOMPONENTS_INCLUDE_DIR-ADVANCED:INTERNAL=1
//ADVANCED property for variable: QT_QTDESIGNERCOMPONENTS_LIBRARY
QT_QTDESIGNERCOMPONENTS_LIBRARY-ADVANCED:INTERNAL=1
//ADVANCED property for variable: QT_QTDESIGNERCOMPONENTS_LIBRARY_DEBUG
QT_QTDESIGNERCOMPONENTS_LIBRARY_DEBUG-ADVANCED:INTERNAL=1
//ADVANCED property for variable: QT_QTDESIGNERCOMPONENTS_LIBRARY_RELEASE
QT_QTDESIGNERCOMPONENTS_LIBRARY_RELEASE-ADVANCED:INTERNAL=1
//ADVANCED property for variable: QT_QTDESIGNER_INCLUDE_DIR
QT_QTDESIGNER_INCLUDE_DIR-ADVANCED:INTERNAL=1
//ADVANCED property for variable: QT_QTDESIGNER_LIBRARY
QT_QTDESIGNER_LIBRARY-ADVANCED:INTERNAL=1
//ADVANCED property for variable: QT_QTDESIGNER_LIBRARY_DEBUG
QT_QTDESIGNER_LIBRARY_DEBUG-ADVANCED:INTERNAL=1
//ADVANCED property for variable: QT_QTDESIGNER_LIBRARY_RELEASE
QT_QTDESIGNER_LIBRARY_RELEASE-ADVANCED:INTERNAL=1
//ADVANCED property for variable: QT_QTGUI_INCLUDE_DIR
QT_QTGUI_INCLUDE_DIR-ADVANCED:INTERNAL=1
//ADVANCED property for variable: QT_QTGUI_LIBRARY
QT_QTGUI_LIBRARY-ADVANCED:INTERNAL=1
//ADVANCED property for variable: QT_QTGUI_LIBRARY_DEBUG
QT_QTGUI_LIBRARY_DEBUG-ADVANCED:INTERNAL=1
//ADVANCED property for variable: QT_QTGUI_LIBRARY_RELEASE
QT_QTGUI_LIBRARY_RELEASE-ADVANCED:INTERNAL=1
//ADVANCED property for variable: QT_QTHELP_INCLUDE_DIR
QT_QTHELP_INCLUDE_DIR-ADVANCED:INTERNAL=1
//ADVANCED property for variable: QT_QTHELP_LIBRARY
QT_QTHELP_LIBRARY-ADVANCED:INTERNAL=1
//ADVANCED property for variable: QT_QTHELP_LIBRARY_DEBUG
QT_QTHELP_LIBRARY_DEBUG-ADVANCED:INTERNAL=1
//ADVANCED property for variable: QT_QTHELP_LIBRARY_RELEASE
QT_QTHELP_LIBRARY_RELEASE-ADVANCED:INTERNAL=1
//ADVANCED property for variable: QT_QTIFF_PLUGIN_DEBUG
QT_QTIFF_PLUGIN_DEBUG-ADVANCED:INTERNAL=1
//ADVANCED property for variable: QT_QTIFF_PLUGIN_RELEASE
QT_QTIFF_PLUGIN_RELEASE-ADVANCED:INTERNAL=1
//ADVANCED property for variable: QT_QTMOTIF_INCLUDE_DIR
QT_QTMOTIF_INCLUDE_DIR-ADVANCED:INTERNAL=1
//ADVANCED property for variable: QT_QTMOTIF_LIBRARY
QT_QTMOTIF_LIBRARY-ADVANCED:INTERNAL=1
//ADVANCED property for variable: QT_QTMOTIF_LIBRARY_DEBUG
QT_QTMOTIF_LIBRARY_DEBUG-ADVANCED:INTERNAL=1
//ADVANCED property for variable: QT_QTMOTIF_LIBRARY_RELEASE
QT_QTMOTIF_LIBRARY_RELEASE-ADVANCED:INTERNAL=1
//ADVANCED property for variable: QT_QTMULTIMEDIA_INCLUDE_DIR
QT_QTMULTIMEDIA_INCLUDE_DIR-ADVANCED:INTERNAL=1
//ADVANCED property for variable: QT_QTMULTIMEDIA_LIBRARY
QT_QTMULTIMEDIA_LIBRARY-ADVANCED:INTERNAL=1
//ADVANCED property for variable: QT_QTMULTIMEDIA_LIBRARY_DEBUG
QT_QTMULTIMEDIA_LIBRARY_DEBUG-ADVANCED:INTERNAL=1
//ADVANCED property for variable: QT_QTMULTIMEDIA_LIBRARY_RELEASE
QT_QTMULTIMEDIA_LIBRARY_RELEASE-ADVANCED:INTERNAL=1
//ADVANCED property for variable: QT_QTNETWORK_INCLUDE_DIR
QT_QTNETWORK_INCLUDE_DIR-ADVANCED:INTERNAL=1
//ADVANCED property for variable: QT_QTNETWORK_LIBRARY
QT_QTNETWORK_LIBRARY-ADVANCED:INTERNAL=1
//ADVANCED property for variable: QT_QTNETWORK_LIBRARY_DEBUG
QT_QTNETWORK_LIBRARY_DEBUG-ADVANCED:INTERNAL=1
//ADVANCED property for variable: QT_QTNETWORK_LIBRARY_RELEASE
QT_QTNETWORK_LIBRARY_RELEASE-ADVANCED:INTERNAL=1
//ADVANCED property for variable: QT_QTNSPLUGIN_INCLUDE_DIR
QT_QTNSPLUGIN_INCLUDE_DIR-ADVANCED:INTERNAL=1
//ADVANCED property for variable: QT_QTNSPLUGIN_LIBRARY
QT_QTNSPLUGIN_LIBRARY-ADVANCED:INTERNAL=1
//ADVANCED property for variable: QT_QTNSPLUGIN_LIBRARY_DEBUG
QT_QTNSPLUGIN_LIBRARY_DEBUG-ADVANCED:INTERNAL=1
//ADVANCED property for variable: QT_QTNSPLUGIN_LIBRARY_RELEASE
QT_QTNSPLUGIN_LIBRARY_RELEASE-ADVANCED:INTERNAL=1
//ADVANCED property for variable: QT_QTOPENGL_INCLUDE_DIR
QT_QTOPENGL_INCLUDE_DIR-ADVANCED:INTERNAL=1
//ADVANCED property for variable: QT_QTOPENGL_LIBRARY
QT_QTOPENGL_LIBRARY-ADVANCED:INTERNAL=1
//ADVANCED property for variable: QT_QTOPENGL_LIBRARY_DEBUG
QT_QTOPENGL_LIBRARY_DEBUG-ADVANCED:INTERNAL=1
//ADVANCED property for variable: QT_QTOPENGL_LIBRARY_RELEASE
QT_QTOPENGL_LIBRARY_RELEASE-ADVANCED:INTERNAL=1
//ADVANCED property for variable: QT_QTRACEGRAPHICSSYSTEM_PLUGIN_DEBUG
QT_QTRACEGRAPHICSSYSTEM_PLUGIN_DEBUG-ADVANCED:INTERNAL=1
//ADVANCED property for variable: QT_QTRACEGRAPHICSSYSTEM_PLUGIN_RELEASE
QT_QTRACEGRAPHICSSYSTEM_PLUGIN_RELEASE-ADVANCED:INTERNAL=1
//ADVANCED property for variable: QT_QTSCRIPTDBUS_PLUGIN_DEBUG
QT_QTSCRIPTDBUS_PLUGIN_DEBUG-ADVANCED:INTERNAL=1
//ADVANCED property for variable: QT_QTSCRIPTDBUS_PLUGIN_RELEASE
QT_QTSCRIPTDBUS_PLUGIN_RELEASE-ADVANCED:INTERNAL=1
//ADVANCED property for variable: QT_QTSCRIPTTOOLS_INCLUDE_DIR
QT_QTSCRIPTTOOLS_INCLUDE_DIR-ADVANCED:INTERNAL=1
//ADVANCED property for variable: QT_QTSCRIPTTOOLS_LIBRARY
QT_QTSCRIPTTOOLS_LIBRARY-ADVANCED:INTERNAL=1
//ADVANCED property for variable: QT_QTSCRIPTTOOLS_LIBRARY_DEBUG
QT_QTSCRIPTTOOLS_LIBRARY_DEBUG-ADVANCED:INTERNAL=1
//ADVANCED property for variable: QT_QTSCRIPTTOOLS_LIBRARY_RELEASE
QT_QTSCRIPTTOOLS_LIBRARY_RELEASE-ADVANCED:INTERNAL=1
//ADVANCED property for variable: QT_QTSCRIPT_INCLUDE_DIR
QT_QTSCRIPT_INCLUDE_DIR-ADVANCED:INTERNAL=1
//ADVANCED property for variable: QT_QTSCRIPT_LIBRARY
QT_QTSCRIPT_LIBRARY-ADVANCED:INTERNAL=1
//ADVANCED property for variable: QT_QTSCRIPT_LIBRARY_DEBUG
QT_QTSCRIPT_LIBRARY_DEBUG-ADVANCED:INTERNAL=1
//ADVANCED property for variable: QT_QTSCRIPT_LIBRARY_RELEASE
QT_QTSCRIPT_LIBRARY_RELEASE-ADVANCED:INTERNAL=1
//ADVANCED property for variable: QT_QTSQL_INCLUDE_DIR
QT_QTSQL_INCLUDE_DIR-ADVANCED:INTERNAL=1
//ADVANCED property for variable: QT_QTSQL_LIBRARY
QT_QTSQL_LIBRARY-ADVANCED:INTERNAL=1
//ADVANCED property for variable: QT_QTSQL_LIBRARY_DEBUG
QT_QTSQL_LIBRARY_DEBUG-ADVANCED:INTERNAL=1
//ADVANCED property for variable: QT_QTSQL_LIBRARY_RELEASE
QT_QTSQL_LIBRARY_RELEASE-ADVANCED:INTERNAL=1
//ADVANCED property for variable: QT_QTSVG_INCLUDE_DIR
QT_QTSVG_INCLUDE_DIR-ADVANCED:INTERNAL=1
//ADVANCED property for variable: QT_QTSVG_LIBRARY
QT_QTSVG_LIBRARY-ADVANCED:INTERNAL=1
//ADVANCED property for variable: QT_QTSVG_LIBRARY_DEBUG
QT_QTSVG_LIBRARY_DEBUG-ADVANCED:INTERNAL=1
//ADVANCED property for variable: QT_QTSVG_LIBRARY_RELEASE
QT_QTSVG_LIBRARY_RELEASE-ADVANCED:INTERNAL=1
//ADVANCED property for variable: QT_QTTEST_INCLUDE_DIR
QT_QTTEST_INCLUDE_DIR-ADVANCED:INTERNAL=1
//ADVANCED property for variable: QT_QTTEST_LIBRARY
QT_QTTEST_LIBRARY-ADVANCED:INTERNAL=1
//ADVANCED property for variable: QT_QTTEST_LIBRARY_DEBUG
QT_QTTEST_LIBRARY_DEBUG-ADVANCED:INTERNAL=1
//ADVANCED property for variable: QT_QTTEST_LIBRARY_RELEASE
QT_QTTEST_LIBRARY_RELEASE-ADVANCED:INTERNAL=1
//ADVANCED property for variable: QT_QTUITOOLS_INCLUDE_DIR
QT_QTUITOOLS_INCLUDE_DIR-ADVANCED:INTERNAL=1
//ADVANCED property for variable: QT_QTUITOOLS_LIBRARY
QT_QTUITOOLS_LIBRARY-ADVANCED:INTERNAL=1
//ADVANCED property for variable: QT_QTUITOOLS_LIBRARY_DEBUG
QT_QTUITOOLS_LIBRARY_DEBUG-ADVANCED:INTERNAL=1
//ADVANCED property for variable: QT_QTUITOOLS_LIBRARY_RELEASE
QT_QTUITOOLS_LIBRARY_RELEASE-ADVANCED:INTERNAL=1
//ADVANCED property for variable: QT_QTWCODECS_PLUGIN_DEBUG
QT_QTWCODECS_PLUGIN_DEBUG-ADVANCED:INTERNAL=1
//ADVANCED property for variable: QT_QTWCODECS_PLUGIN_RELEASE
QT_QTWCODECS_PLUGIN_RELEASE-ADVANCED:INTERNAL=1
//ADVANCED property for variable: QT_QTWEBKIT_INCLUDE_DIR
QT_QTWEBKIT_INCLUDE_DIR-ADVANCED:INTERNAL=1
//ADVANCED property for variable: QT_QTWEBKIT_LIBRARY
QT_QTWEBKIT_LIBRARY-ADVANCED:INTERNAL=1
//ADVANCED property for variable: QT_QTWEBKIT_LIBRARY_DEBUG
QT_QTWEBKIT_LIBRARY_DEBUG-ADVANCED:INTERNAL=1
//ADVANCED property for variable: QT_QTWEBKIT_LIBRARY_RELEASE
QT_QTWEBKIT_LIBRARY_RELEASE-ADVANCED:INTERNAL=1
//ADVANCED property for variable: QT_QTXMLPATTERNS_INCLUDE_DIR
QT_QTXMLPATTERNS_INCLUDE_DIR-ADVANCED:INTERNAL=1
//ADVANCED property for variable: QT_QTXMLPATTERNS_LIBRARY
QT_QTXMLPATTERNS_LIBRARY-ADVANCED:INTERNAL=1
//ADVANCED property for variable: QT_QTXMLPATTERNS_LIBRARY_DEBUG
QT_QTXMLPATTERNS_LIBRARY_DEBUG-ADVANCED:INTERNAL=1
//ADVANCED property for variable: QT_QTXMLPATTERNS_LIBRARY_RELEASE
QT_QTXMLPATTERNS_LIBRARY_RELEASE-ADVANCED:INTERNAL=1
//ADVANCED property for variable: QT_QTXML_INCLUDE_DIR
QT_QTXML_INCLUDE_DIR-ADVANCED:INTERNAL=1
//ADVANCED property for variable: QT_QTXML_LIBRARY
QT_QTXML_LIBRARY-ADVANCED:INTERNAL=1
//ADVANCED property for variable: QT_QTXML_LIBRARY_DEBUG
QT_QTXML_LIBRARY_DEBUG-ADVANCED:INTERNAL=1
//ADVANCED property for variable: QT_QTXML_LIBRARY_RELEASE
QT_QTXML_LIBRARY_RELEASE-ADVANCED:INTERNAL=1
//ADVANCED property for variable: QT_QWEBVIEW_PLUGIN_DEBUG
QT_QWEBVIEW_PLUGIN_DEBUG-ADVANCED:INTERNAL=1
//ADVANCED property for variable: QT_QWEBVIEW_PLUGIN_RELEASE
QT_QWEBVIEW_PLUGIN_RELEASE-ADVANCED:INTERNAL=1
//ADVANCED property for variable: QT_QWSTSLIBMOUSEHANDLER_PLUGIN_DEBUG
QT_QWSTSLIBMOUSEHANDLER_PLUGIN_DEBUG-ADVANCED:INTERNAL=1
//ADVANCED property for variable: QT_QWSTSLIBMOUSEHANDLER_PLUGIN_RELEASE
QT_QWSTSLIBMOUSEHANDLER_PLUGIN_RELEASE-ADVANCED:INTERNAL=1
//ADVANCED property for variable: QT_RCC_EXECUTABLE
QT_RCC_EXECUTABLE-ADVANCED:INTERNAL=1
//ADVANCED property for variable: QT_TASKMENUEXTENSION_PLUGIN_DEBUG
QT_TASKMENUEXTENSION_PLUGIN_DEBUG-ADVANCED:INTERNAL=1
//ADVANCED property for variable: QT_TASKMENUEXTENSION_PLUGIN_RELEASE
QT_TASKMENUEXTENSION_PLUGIN_RELEASE-ADVANCED:INTERNAL=1
//ADVANCED property for variable: QT_TRANSLATIONS_DIR
QT_TRANSLATIONS_DIR-ADVANCED:INTERNAL=1
//ADVANCED property for variable: QT_UIC3_EXECUTABLE
QT_UIC3_EXECUTABLE-ADVANCED:INTERNAL=1
//ADVANCED property for variable: QT_UIC_EXECUTABLE
QT_UIC_EXECUTABLE-ADVANCED:INTERNAL=1
//ADVANCED property for variable: QT_WORLDTIMECLOCKPLUGIN_PLUGIN_DEBUG
QT_WORLDTIMECLOCKPLUGIN_PLUGIN_DEBUG-ADVANCED:INTERNAL=1
//ADVANCED property for variable: QT_WORLDTIMECLOCKPLUGIN_PLUGIN_RELEASE
QT_WORLDTIMECLOCKPLUGIN_PLUGIN_RELEASE-ADVANCED:INTERNAL=1
//Have symbol Q_WS_MAC
Q_WS_MAC:INTERNAL=
//Have symbol Q_WS_QWS
Q_WS_QWS:INTERNAL=
//Have symbol Q_WS_WIN
Q_WS_WIN:INTERNAL=
//Have symbol Q_WS_X11
Q_WS_X11:INTERNAL=1
//ADVANCED property for variable: SPHINX_EXECUTABLE
SPHINX_EXECUTABLE-ADVANCED:INTERNAL=1
//ADVANCED property for variable: USE_PROJECT_FOLDERS
USE_PROJECT_FOLDERS-ADVANCED:INTERNAL=1
//MODIFIED property for variable: USE_UMFPACK
USE_UMFPACK-MODIFIED:INTERNAL=ON
//VTK_USE_FILE
VTK_USE_FILE:INTERNAL=/usr/lib/vtk-5.8/UseVTK.cmake
//ADVANCED property for variable: X11_ICE_INCLUDE_PATH
X11_ICE_INCLUDE_PATH-ADVANCED:INTERNAL=1
//ADVANCED property for variable: X11_ICE_LIB
X11_ICE_LIB-ADVANCED:INTERNAL=1
//Have library /usr/lib/x86_64-linux-gnu/libX11.so;/usr/lib/x86_64-linux-gnu/libXext.so
X11_LIB_X11_SOLO:INTERNAL=1
//ADVANCED property for variable: X11_SM_INCLUDE_PATH
X11_SM_INCLUDE_PATH-ADVANCED:INTERNAL=1
//ADVANCED property for variable: X11_SM_LIB
X11_SM_LIB-ADVANCED:INTERNAL=1
//ADVANCED property for variable: X11_X11_INCLUDE_PATH
X11_X11_INCLUDE_PATH-ADVANCED:INTERNAL=1
//ADVANCED property for variable: X11_X11_LIB
X11_X11_LIB-ADVANCED:INTERNAL=1
//ADVANCED property for variable: X11_XRes_INCLUDE_PATH
X11_XRes_INCLUDE_PATH-ADVANCED:INTERNAL=1
//ADVANCED property for variable: X11_XRes_LIB
X11_XRes_LIB-ADVANCED:INTERNAL=1
//ADVANCED property for variable: X11_XShm_INCLUDE_PATH
X11_XShm_INCLUDE_PATH-ADVANCED:INTERNAL=1
//ADVANCED property for variable: X11_XSync_INCLUDE_PATH
X11_XSync_INCLUDE_PATH-ADVANCED:INTERNAL=1
//ADVANCED property for variable: X11_XTest_INCLUDE_PATH
X11_XTest_INCLUDE_PATH-ADVANCED:INTERNAL=1
//ADVANCED property for variable: X11_XTest_LIB
X11_XTest_LIB-ADVANCED:INTERNAL=1
//ADVANCED property for variable: X11_Xaccessrules_INCLUDE_PATH
X11_Xaccessrules_INCLUDE_PATH-ADVANCED:INTERNAL=1
//ADVANCED property for variable: X11_Xaccessstr_INCLUDE_PATH
X11_Xaccessstr_INCLUDE_PATH-ADVANCED:INTERNAL=1
//ADVANCED property for variable: X11_Xau_INCLUDE_PATH
X11_Xau_INCLUDE_PATH-ADVANCED:INTERNAL=1
//ADVANCED property for variable: X11_Xau_LIB
X11_Xau_LIB-ADVANCED:INTERNAL=1
//ADVANCED property for variable: X11_Xcomposite_INCLUDE_PATH
X11_Xcomposite_INCLUDE_PATH-ADVANCED:INTERNAL=1
//ADVANCED property for variable: X11_Xcomposite_LIB
X11_Xcomposite_LIB-ADVANCED:INTERNAL=1
//ADVANCED property for variable: X11_Xcursor_INCLUDE_PATH
X11_Xcursor_INCLUDE_PATH-ADVANCED:INTERNAL=1
//ADVANCED property for variable: X11_Xcursor_LIB
X11_Xcursor_LIB-ADVANCED:INTERNAL=1
//ADVANCED property for variable: X11_Xdamage_INCLUDE_PATH
X11_Xdamage_INCLUDE_PATH-ADVANCED:INTERNAL=1
//ADVANCED property for variable: X11_Xdamage_LIB
X11_Xdamage_LIB-ADVANCED:INTERNAL=1
//ADVANCED property for variable: X11_Xdmcp_INCLUDE_PATH
X11_Xdmcp_INCLUDE_PATH-ADVANCED:INTERNAL=1
//ADVANCED property for variable: X11_Xdmcp_LIB
X11_Xdmcp_LIB-ADVANCED:INTERNAL=1
//ADVANCED property for variable: X11_Xext_LIB
X11_Xext_LIB-ADVANCED:INTERNAL=1
//ADVANCED property for variable: X11_Xfixes_INCLUDE_PATH
X11_Xfixes_INCLUDE_PATH-ADVANCED:INTERNAL=1
//ADVANCED property for variable: X11_Xfixes_LIB
X11_Xfixes_LIB-ADVANCED:INTERNAL=1
//ADVANCED property for variable: X11_Xft_INCLUDE_PATH
X11_Xft_INCLUDE_PATH-ADVANCED:INTERNAL=1
//ADVANCED property for variable: X11_Xft_LIB
X11_Xft_LIB-ADVANCED:INTERNAL=1
//ADVANCED property for variable: X11_Xi_INCLUDE_PATH
X11_Xi_INCLUDE_PATH-ADVANCED:INTERNAL=1
//ADVANCED property for variable: X11_Xi_LIB
X11_Xi_LIB-ADVANCED:INTERNAL=1
//ADVANCED property for variable: X11_Xinerama_INCLUDE_PATH
X11_Xinerama_INCLUDE_PATH-ADVANCED:INTERNAL=1
//ADVANCED property for variable: X11_Xinerama_LIB
X11_Xinerama_LIB-ADVANCED:INTERNAL=1
//ADVANCED property for variable: X11_Xinput_INCLUDE_PATH
X11_Xinput_INCLUDE_PATH-ADVANCED:INTERNAL=1
//ADVANCED property for variable: X11_Xinput_LIB
X11_Xinput_LIB-ADVANCED:INTERNAL=1
//ADVANCED property for variable: X11_Xkb_INCLUDE_PATH
X11_Xkb_INCLUDE_PATH-ADVANCED:INTERNAL=1
//ADVANCED property for variable: X11_Xkbfile_INCLUDE_PATH
X11_Xkbfile_INCLUDE_PATH-ADVANCED:INTERNAL=1
//ADVANCED property for variable: X11_Xkbfile_LIB
X11_Xkbfile_LIB-ADVANCED:INTERNAL=1
//ADVANCED property for variable: X11_Xkblib_INCLUDE_PATH
X11_Xkblib_INCLUDE_PATH-ADVANCED:INTERNAL=1
//ADVANCED property for variable: X11_Xlib_INCLUDE_PATH
X11_Xlib_INCLUDE_PATH-ADVANCED:INTERNAL=1
//ADVANCED property for variable: X11_Xmu_INCLUDE_PATH
X11_Xmu_INCLUDE_PATH-ADVANCED:INTERNAL=1
//ADVANCED property for variable: X11_Xmu_LIB
X11_Xmu_LIB-ADVANCED:INTERNAL=1
//ADVANCED property for variable: X11_Xpm_INCLUDE_PATH
X11_Xpm_INCLUDE_PATH-ADVANCED:INTERNAL=1
//ADVANCED property for variable: X11_Xpm_LIB
X11_Xpm_LIB-ADVANCED:INTERNAL=1
//ADVANCED property for variable: X11_Xrandr_INCLUDE_PATH
X11_Xrandr_INCLUDE_PATH-ADVANCED:INTERNAL=1
//ADVANCED property for variable: X11_Xrandr_LIB
X11_Xrandr_LIB-ADVANCED:INTERNAL=1
//ADVANCED property for variable: X11_Xrender_INCLUDE_PATH
X11_Xrender_INCLUDE_PATH-ADVANCED:INTERNAL=1
//ADVANCED property for variable: X11_Xrender_LIB
X11_Xrender_LIB-ADVANCED:INTERNAL=1
//ADVANCED property for variable: X11_Xscreensaver_INCLUDE_PATH
X11_Xscreensaver_INCLUDE_PATH-ADVANCED:INTERNAL=1
//ADVANCED property for variable: X11_Xscreensaver_LIB
X11_Xscreensaver_LIB-ADVANCED:INTERNAL=1
//ADVANCED property for variable: X11_Xshape_INCLUDE_PATH
X11_Xshape_INCLUDE_PATH-ADVANCED:INTERNAL=1
//ADVANCED property for variable: X11_Xt_INCLUDE_PATH
X11_Xt_INCLUDE_PATH-ADVANCED:INTERNAL=1
//ADVANCED property for variable: X11_Xt_LIB
X11_Xt_LIB-ADVANCED:INTERNAL=1
//ADVANCED property for variable: X11_Xutil_INCLUDE_PATH
X11_Xutil_INCLUDE_PATH-ADVANCED:INTERNAL=1
//ADVANCED property for variable: X11_Xv_INCLUDE_PATH
X11_Xv_INCLUDE_PATH-ADVANCED:INTERNAL=1
//ADVANCED property for variable: X11_Xv_LIB
X11_Xv_LIB-ADVANCED:INTERNAL=1
//ADVANCED property for variable: X11_Xxf86misc_LIB
X11_Xxf86misc_LIB-ADVANCED:INTERNAL=1
//ADVANCED property for variable: X11_Xxf86vm_LIB
X11_Xxf86vm_LIB-ADVANCED:INTERNAL=1
//ADVANCED property for variable: X11_dpms_INCLUDE_PATH
X11_dpms_INCLUDE_PATH-ADVANCED:INTERNAL=1
//ADVANCED property for variable: X11_xf86misc_INCLUDE_PATH
X11_xf86misc_INCLUDE_PATH-ADVANCED:INTERNAL=1
//ADVANCED property for variable: X11_xf86vmode_INCLUDE_PATH
X11_xf86vmode_INCLUDE_PATH-ADVANCED:INTERNAL=1
//ADVANCED property for variable: ZLIB_INCLUDE_DIR
ZLIB_INCLUDE_DIR-ADVANCED:INTERNAL=1
//ADVANCED property for variable: ZLIB_LIBRARY
ZLIB_LIBRARY-ADVANCED:INTERNAL=1
//Last used Boost_ADDITIONAL_VERSIONS value.
_Boost_ADDITIONAL_VERSIONS_LAST:INTERNAL=1.47;1.47.0;1.48;1.48.0;1.49;1.49.0
//Components requested for this build tree.
_Boost_COMPONENTS_SEARCHED:INTERNAL=chrono;date_time;filesystem;iostreams;mpi;serialization;system;thread
//Last used Boost_INCLUDE_DIR value.
_Boost_INCLUDE_DIR_LAST:INTERNAL=/usr/include
//Last used Boost_LIBRARY_DIR value.
_Boost_LIBRARY_DIR_LAST:INTERNAL=/usr/lib/x86_64-linux-gnu
//Last used Boost_USE_MULTITHREADED value.
_Boost_USE_MULTITHREADED_LAST:INTERNAL=TRUE
__pkg_config_checked_METSLIB:INTERNAL=1
__pkg_config_checked_PC_EIGEN:INTERNAL=1
__pkg_config_checked_PC_FLANN:INTERNAL=1
__pkg_config_checked_PC_OPENNI:INTERNAL=1
__pkg_config_checked_PC_OPENNI2:INTERNAL=1
__pkg_config_checked_PC_SPHINX:INTERNAL=1
__pkg_config_checked_PC_USB_10:INTERNAL=1
 
Bye!
Reply | Threaded
Open this post in threaded view
|

Re: 1.7.2 Release Candidate

Martin
Everything compiles fine with the default configuration in CMake (my only change was to set CMAKE_BUILD_TYPE to Release). After that I enabled everything which is disabled by default. The examples, tools and tests compile fine.

Unittests work except:

         65 - io_io (SEGFAULT)
         69 - io_ply_mesh_io (Failed)

There are a few problems when compiling the apps.

As a quick fix I put 'set(VTK_USE_QVTK FALSE)' at the end of PCL_SRC/cmake/Modules/FindQVTK.cmake (I don't have QVTK). This will disable apps which require QVTK. Somehow both QT4_FOUND and VTK_USE_QVTK were set to true although I even don't have Qt4.

I had to disable BUILD_apps_point_cloud_editor because of this error:

Building CXX object apps/point_cloud_editor/CMakeFiles/pcl_point_cloud_editor.dir/src/main.cpp.o
In file included from /Users/Martin/libs/pcl/src/apps/point_cloud_editor/src/main.cpp:54:
/Users/Martin/libs/pcl/src/apps/point_cloud_editor/include/pcl/apps/point_cloud_editor/mainWindow.h:133:5: error: unknown type name
      'QActionGroup'; did you mean 'QAnimationGroup'?
    QActionGroup* action_group_;
    ^~~~~~~~~~~~
    QAnimationGroup
/opt/local/Library/Frameworks/QtCore.framework/Headers/qanimationgroup.h:53:21: note: 'QAnimationGroup' declared here
class Q_CORE_EXPORT QAnimationGroup : public QAbstractAnimation
                    ^
In file included from /Users/Martin/libs/pcl/src/apps/point_cloud_editor/src/main.cpp:54:
/Users/Martin/libs/pcl/src/apps/point_cloud_editor/include/pcl/apps/point_cloud_editor/mainWindow.h:217:5: error: unknown type name
      'QSpinBox'
    QSpinBox *point_size_spin_box_;
    ^
/Users/Martin/libs/pcl/src/apps/point_cloud_editor/include/pcl/apps/point_cloud_editor/mainWindow.h:220:5: error: unknown type name
      'QSpinBox'
    QSpinBox *selected_point_size_spin_box_;
    ^
/Users/Martin/libs/pcl/src/apps/point_cloud_editor/include/pcl/apps/point_cloud_editor/mainWindow.h:235:6: error: unknown type name
      'QSlider'
     QSlider *move_speed_slider_;
     ^
/Users/Martin/libs/pcl/src/apps/point_cloud_editor/src/main.cpp:62:3: error: cannot initialize object parameter of type 'QWidget'
      with an expression of type 'MainWindow'
  main_window.show();
  ^~~~~~~~~~~
5 errors generated.
make[2]: *** [apps/point_cloud_editor/CMakeFiles/pcl_point_cloud_editor.dir/src/main.cpp.o] Error 1
make[1]: *** [apps/point_cloud_editor/CMakeFiles/pcl_point_cloud_editor.dir/all] Error 2
make: *** [all] Error 2

--------------------------------------------------------------------------------
--------------------------------------------------------------------------------

Environment:

$ gcc --version
Configured with: --prefix=/Applications/Xcode.app/Contents/Developer/usr --with-gxx-include-dir=/usr/include/c++/4.2.1
Apple LLVM version 5.1 (clang-503.0.40) (based on LLVM 3.4svn)
Target: x86_64-apple-darwin13.3.0
Thread model: posix

vtk-6.1.0 compiled from source (SHA1=82840f008383c7767c693edb82ddddab1d9f9a51), without VTK_Group_Qt.

qt5-mac @5.3.1_0 from macports

libusb from macports
Reply | Threaded
Open this post in threaded view
|

Re: 1.7.2 Release Candidate

Sergey
Administrator
Thanks for the feedback.

I have basically the same setup as you, Victor, and both compilation and tests succeed. The only difference is that I use clang 3.4.

Martin wrote
Unittests work except:

         65 - io_io (SEGFAULT)
         69 - io_ply_mesh_io (Failed)
Obviously, we do not have these problems on Linux. Could you create an issue on GitHub and add some more details (i.e. which particular test case fails)?

Martin wrote
I had to disable BUILD_apps_point_cloud_editor because of this error:
What about other apps/examples that require Qt?

Regards,
Sergey
Reply | Threaded
Open this post in threaded view
|

Re: 1.7.2 Release Candidate

VictorL
This post was updated on .
Test 75 fails on my side

test 75
      Start 75: a_registration_test

75: Test command: /home/dell/pcl-1.7.2rc1.1/build/test/registration/test_registration "/home/dell/pcl-1.7.2rc1.1/test/bun0.pcd" "/home/dell/pcl-1.7.2rc1.1/test/bun4.pcd" "/home/dell/pcl-1.7.2rc1.1/test/milk_color.pcd"
75: Test timeout computed to be: 9.99988e+06
75: [==========] Running 12 tests from 1 test case.
75: [----------] Global test environment set-up.
75: [----------] 12 tests from PCL
75: [ RUN      ] PCL.findFeatureCorrespondences
75: [       OK ] PCL.findFeatureCorrespondences (1 ms)
75: [ RUN      ] PCL.IterativeClosestPoint
75: [       OK ] PCL.IterativeClosestPoint (13 ms)
75: [ RUN      ] PCL.IterativeClosestPointWithRejectors
75: /home/dell/pcl-1.7.2rc1.1/test/registration/test_registration.cpp:256: Failure
75: The difference between trans_final (y, 3) and delta_transform (y, 3) is 1.26786869764328, which exceeds 1E-2, where
75: trans_final (y, 3) evaluates to 1.3129791021347046,
75: delta_transform (y, 3) evaluates to 0.045110404491424561, and
75: 1E-2 evaluates to 0.01.
75: /home/dell/pcl-1.7.2rc1.1/test/registration/test_registration.cpp:256: Failure
75: The difference between trans_final (y, 3) and delta_transform (y, 3) is 0.36507434025406837, which exceeds 1E-2, where
75: trans_final (y, 3) evaluates to 0.41360604763031006,
75: delta_transform (y, 3) evaluates to 0.048531707376241684, and
75: 1E-2 evaluates to 0.01.
75: /home/dell/pcl-1.7.2rc1.1/test/registration/test_registration.cpp:256: Failure
75: The difference between trans_final (y, 3) and delta_transform (y, 3) is 1.1379720997065306, which exceeds 1E-2, where
75: trans_final (y, 3) evaluates to -1.1260581016540527,
75: delta_transform (y, 3) evaluates to 0.011913998052477837, and
75: 1E-2 evaluates to 0.01.
75: /home/dell/pcl-1.7.2rc1.1/test/registration/test_registration.cpp:260: Failure
75: The difference between trans_final (y, x) and delta_transform (y, x) is 0.13332590460777283, which exceeds 1E-1, where
75: trans_final (y, x) evaluates to -0.13332590460777283,
75: delta_transform (y, x) evaluates to 0, and
75: 1E-1 evaluates to 0.10000000000000001.
75: /home/dell/pcl-1.7.2rc1.1/test/registration/test_registration.cpp:260: Failure
75: The difference between trans_final (y, x) and delta_transform (y, x) is 0.13558734953403473, which exceeds 1E-1, where
75: trans_final (y, x) evaluates to 0.13558734953403473,
75: delta_transform (y, x) evaluates to 0, and
75: 1E-1 evaluates to 0.10000000000000001.
75: [  FAILED  ] PCL.IterativeClosestPointWithRejectors (273 ms)
75: [ RUN      ] PCL.JointIterativeClosestPoint
75: [pcl::RandomSampleConsensus::computeModel] No samples could be selected!
75: [       OK ] PCL.JointIterativeClosestPoint (819 ms)
75: [ RUN      ] PCL.IterativeClosestPointNonLinear
75: [       OK ] PCL.IterativeClosestPointNonLinear (136 ms)
75: [ RUN      ] PCL.IterativeClosestPoint_PointToPlane
75: [       OK ] PCL.IterativeClosestPoint_PointToPlane (347 ms)
75: [ RUN      ] PCL.GeneralizedIterativeClosestPoint
75: [       OK ] PCL.GeneralizedIterativeClosestPoint (245 ms)
75: [ RUN      ] PCL.GeneralizedIterativeClosestPoint6D
75: [       OK ] PCL.GeneralizedIterativeClosestPoint6D (153 ms)
75: [ RUN      ] PCL.NormalDistributionsTransform
75: [       OK ] PCL.NormalDistributionsTransform (456 ms)
75: [ RUN      ] PCL.SampleConsensusInitialAlignment
75: [       OK ] PCL.SampleConsensusInitialAlignment (5140 ms)
75: [ RUN      ] PCL.SampleConsensusPrerejective
75: [       OK ] PCL.SampleConsensusPrerejective (3600 ms)
75: [ RUN      ] PCL.PyramidFeatureHistogram
75: [       OK ] PCL.PyramidFeatureHistogram (1426 ms)
75: [----------] 12 tests from PCL (12609 ms total)
75:
75: [----------] Global test environment tear-down
75: [==========] 12 tests from 1 test case ran. (12609 ms total)
75: [  PASSED  ] 11 tests.
75: [  FAILED  ] 1 test, listed below:
75: [  FAILED  ] PCL.IterativeClosestPointWithRejectors
75:
75:  1 FAILED TEST
75:
75/97 Test #75: a_registration_test ....................***Failed   12.68 sec
EDIT: The test number is 75 not 77 !

Reply | Threaded
Open this post in threaded view
|

Re: 1.7.2 Release Candidate

Sergey
Administrator
Victor,

Yep, this seems to be gcc-related (see #677).

Regards,
Sergey
Reply | Threaded
Open this post in threaded view
|

Re: 1.7.2 Release Candidate

Sergey
Administrator
So summarizing, we have the following problems:

[1] A few tests do not pass with gcc, but pass with clang.
[2.1, 2.2] A few PLY i/o tests fail on Mac OS.
[3] It is no longer possible to create pcl_features lib using msvc.

To solve the last one I propose to exclude GRSD/RSD features from 1.7.2. This will take us again
below 65535 objects. Hopefully, in the meanwhile someone from the Windows world will find a
proper solution.

As for the first two problems, it is not clear who and when is going to address them. Perhaps they
are not too critical to prevent us from releasing 1.7.2. But if they are, then we are stuck...

Regards,
Sergey
Reply | Threaded
Open this post in threaded view
|

Re: 1.7.2 Release Candidate

Jochen Sprickerhof
Administrator
I've just merged master again an pushed it as pcl-1.7.2rc2. If there are
no complaints, I will make it pcl-1.7.2 next week.

* Sergey <[hidden email]> [2014-08-16 10:54]:
> To solve the last one I propose to exclude GRSD/RSD features from 1.7.2.
> This will take us again below 65535 objects.

Sounds good, done in rc2.

> Hopefully, in the meanwhile someone from the Windows world will find a
> proper solution.

Maybe we should set PCL_ONLY_CORE_POINT_TYPES on Windows for 1.8?

> As for the first two problems, it is not clear who and when is going to
> address them. Perhaps they
> are not too critical to prevent us from releasing 1.7.2. But if they are,
> then we are stuck...

I think they are not critical. #677 is about new stuff not in 1.7.1 and
the Mac OS stuff, I've no way to test..

Cheers Jochen

_______________________________________________
PCL-developers mailing list
[hidden email]
http://pointclouds.org/mailman/listinfo/pcl-developers
http://pointclouds.org

signature.asc (836 bytes) Download Attachment
Reply | Threaded
Open this post in threaded view
|

Re: 1.7.2 Release Candidate

Jochen Sprickerhof
Administrator
Forgot one commit from master needed for ROS, so there is now a
pcl-1.7.2rc2.1

Cheers Jochen

_______________________________________________
PCL-developers mailing list
[hidden email]
http://pointclouds.org/mailman/listinfo/pcl-developers
http://pointclouds.org

signature.asc (836 bytes) Download Attachment
Reply | Threaded
Open this post in threaded view
|

Re: 1.7.2 Release Candidate

Sergey
Administrator
Hi,

I think we should get this one fixed before releasing. Since there is already a preliminary solution, I think that is possible.

Regards,
Sergey
Reply | Threaded
Open this post in threaded view
|

Re: 1.7.2 Release Candidate

Jochen Sprickerhof
Administrator
* Sergey <[hidden email]> [2014-08-21 09:15]:
> I think we should get  this one
> <https://github.com/PointCloudLibrary/pcl/issues/864>   fixed before
> releasing. Since there is already a preliminary solution, I think that is
> possible.

Yes would he great.

Cheers Jochen

_______________________________________________
PCL-developers mailing list
[hidden email]
http://pointclouds.org/mailman/listinfo/pcl-developers
http://pointclouds.org

signature.asc (836 bytes) Download Attachment
Reply | Threaded
Open this post in threaded view
|

Re: 1.7.2 Release Candidate

Sergey
Administrator
Jochen,

The fix is there, tested with Boost 1.53, 1.55, and 1.56. Since I anyways had
to install the latest Boost I compiled and tested the release candidate with it. Unfortunately, I was not able to compile (at least some of) the Qt apps.


    apps/cloud_composer/include/pcl/apps/cloud_composer/qt.h:0: Note: No relevant classes found. No output generated.
    /opt/boost-1.56/include/boost/type_traits/detail/has_binary_operator.hp:50: Parse error at "BOOST_JOIN"
    apps/cloud_composer/CMakeFiles/pcl_cloud_composer.dir/build.make:73: recipe for target 'apps/cloud_composer/include/pcl/apps/cloud_composer/moc_cloud_viewer.cxx' failed


Obviously, this is related to Qt4 bug. In our CMakeFiles we apply workarounds discussed in the referenced thread, however
it seems like in the new Boost version some more "type_traits" headers are included not from "has_operator.hpp",
so more the workarounds have to be updated.

Apart from that everything is fine.

Regards,
Sergey
Reply | Threaded
Open this post in threaded view
|

Re: 1.7.2 Release Candidate

VictorL
Hello,

I think the problems related to the PLY reader are critical; it prevents the user from loading some PLY files and worse, it sometimes deform the PLY file when visualized:

https://github.com/PointCloudLibrary/pcl/issues/675
https://github.com/PointCloudLibrary/pcl/issues/626
https://github.com/PointCloudLibrary/pcl/issues/631
https://github.com/PointCloudLibrary/pcl/issues/836

https://github.com/PointCloudLibrary/pcl/issues/708

I can try to find a solution but I'm afraid it's a little bit out of my sight!

Bye
Reply | Threaded
Open this post in threaded view
|

Re: 1.7.2 Release Candidate

Sergey
Administrator
Victor,

These issues have been around for a while. Yes, they are nasty. But apparently no one put effort
into resolving them and submitting a patch, which may be an indication of that they are not so
critical after all.

I would say let's release 1.7.2 as is, otherwise we could wait forever until every bug is fixed.
Especially when there is no one working on fixing them :)

I will tag 1.7.2 later today. Jochen said he will update his PPA next week, so I guess we postpone
official announcement till that time.

By the way, prebuilt packages for Windows and Mac OS have not been updated for quite some
time. It would be nice to provide them for 1.7.2, but we will need volunteers to create them.

Regards,
Sergey
Reply | Threaded
Open this post in threaded view
|

Re: 1.7.2 Release Candidate

kwaegel
Administrator
If no one has rebuilt the Windows packages by late next month (when I finally have time), I'll take a crack at it. I can only attempt the VS2010 packages, though. I haven't had VS2008 installed in years.

Do we have any docs on how they were created last time, or should I just read the build scripts? I remember having boost path length issues last time I tried.
Reply | Threaded
Open this post in threaded view
|

Re: 1.7.2 Release Candidate

nizar sallem-3
In reply to this post by Sergey

As soon as I have a chance I will look at those. Can you send me a potentially faulty file so that I can fix it as ASAP.


--

Nizar

------ Original message------

From: VictorL

Date: Mon, Aug 25, 2014 00:24

To: [hidden email];

Subject:Re: [PCL-developers] 1.7.2 Release Candidate

Hello,I think the problems related to the PLY reader are critical; it prevents theuser from loading some PLY files and worse, it sometimes deform the PLY filewhen visualized:https://github.com/PointCloudLibrary/pcl/issues/675https://github.com/PointCloudLibrary/pcl/issues/626https://github.com/PointCloudLibrary/pcl/issues/631https://github.com/PointCloudLibrary/pcl/issues/836https://github.com/PointCloudLibrary/pcl/issues/708I can try to find a solution but I'm afraid it's a little bit out of mysight!Bye--View this message in context: http://www.pcl-developers.org/1-7-2-Release-Candidate-tp5709594p5709633.htmlSent from the Point Cloud Library (PCL) Developers mailing list mailing list archive at Nabble.com._______________________________________________PCL-developers mailing[hidden email]p://pointclouds.org/mailman/listinfo/pcl-developershttp://pointclouds.org

_______________________________________________
PCL-developers mailing list
[hidden email]
http://pointclouds.org/mailman/listinfo/pcl-developers
http://pointclouds.org
Reply | Threaded
Open this post in threaded view
|

Re: 1.7.2 Release Candidate

VictorL
Hello,

Here is an example which makes PCL ply reader crash:

ply
format ascii 1.0
element vertex 8
property float x
property float y
property float z
element face 3
property list uchar int vertex_indices
end_header
0 0 0
0 0 1
0 1 0
0 1 1
1 0 0
1 0 1
1 1 0
1 1 1
3 1 2 3
3 1 2 4
3 3 4 1
#include <pcl/io/ply_io.h>

int
main (int argc, char *argv[])
{
  pcl::PointCloud<pcl::PointXYZRGBA> cloud;

  int rvalue;
  rvalue = pcl::io::loadPLYFile ("../cloud_.ply", cloud);
  printf ("loadPLYFile = %d\n", rvalue);

  if (rvalue < 0)
  {
    PCL_ERROR ("Could not load file !\n");
    return (-1);
  }

  return (0);
}
This PLY file can be opened with MeshLab
Reply | Threaded
Open this post in threaded view
|

Re: 1.7.2 Release Candidate

Sergey
Administrator
In reply to this post by kwaegel
Hi Ky,

I was browsing closed pull requests yesterday to assemble a changelog. In one of them Radu mentioned
that Stefan Holzer is (or at least used to be) one of PCL Windows maintainers. So perhaps he could give
some information on how to create packages.

Regards,
Sergey
12