Compilation problem with version 1.8

classic Classic list List threaded Threaded
1 message Options
Reply | Threaded
Open this post in threaded view
|  
Report Content as Inappropriate

Compilation problem with version 1.8

David Olivieri
This post has NOT been accepted by the mailing list yet.
Hi
Recently I tried to install pcl version 1.8 with full success, but found that the CMakeList.txt in directoryPCL/Surface needed a certain flag to set to ON to allow the full NuRBS library to be installed. I corrected this and tried to re-install the pcl library. After an initial successful build of BUILD-ALL I attempted to install as administrator and found the following errors occurring after building just the INSTALL
How would you resolve the missing AppvIsvStream32.dll issue?

David Olivieri

>  -- Up-to-date: C:/Program Files (x86)/PCL/3rdParty/Boost/Microsoft Office/root/client/AppVDllSurrogate64.exe
>  CMake Error at cmake_install.cmake:46 (file):
>    file INSTALL cannot read symlink "C:/Program Files (x86)/Microsoft
>    Office/root/client/AppvIsvStream32.dll" to duplicate at "C:/Program Files
>    (x86)/PCL/3rdParty/Boost/Microsoft Office/root/client/AppvIsvStream32.dll".
>  
>C:\Program Files (x86)\MSBuild\Microsoft.Cpp\v4.0\Microsoft.CppCommon.targets(113,5): error MSB3073: The command "setlocal
>C:\Program Files (x86)\MSBuild\Microsoft.Cpp\v4.0\Microsoft.CppCommon.targets(113,5): error MSB3073: "C:\Program Files (x86)\CMake\bin\cmake.exe" -DBUILD_TYPE=Release -P cmake_install.cmake
>C:\Program Files (x86)\MSBuild\Microsoft.Cpp\v4.0\Microsoft.CppCommon.targets(113,5): error MSB3073: if %errorlevel% neq 0 goto :cmEnd
>C:\Program Files (x86)\MSBuild\Microsoft.Cpp\v4.0\Microsoft.CppCommon.targets(113,5): error MSB3073: :cmEnd
>C:\Program Files (x86)\MSBuild\Microsoft.Cpp\v4.0\Microsoft.CppCommon.targets(113,5): error MSB3073: endlocal & call :cmErrorLevel %errorlevel% & goto :cmDone
>C:\Program Files (x86)\MSBuild\Microsoft.Cpp\v4.0\Microsoft.CppCommon.targets(113,5): error MSB3073: :cmErrorLevel
>C:\Program Files (x86)\MSBuild\Microsoft.Cpp\v4.0\Microsoft.CppCommon.targets(113,5): error MSB3073: exit /b %1
>C:\Program Files (x86)\MSBuild\Microsoft.Cpp\v4.0\Microsoft.CppCommon.targets(113,5): error MSB3073: :cmDone
>C:\Program Files (x86)\MSBuild\Microsoft.Cpp\v4.0\Microsoft.CppCommon.targets(113,5): error MSB3073: if %errorlevel% neq 0 goto :VCEnd
>C:\Program Files (x86)\MSBuild\Microsoft.Cpp\v4.0\Microsoft.CppCommon.targets(113,5): error MSB3073: :VCEnd" exited with code 1.
========== Build: 0 succeeded, 1 failed, 126 up-to-date, 0 skipped ==========
Loading...